program: Orca
programVersion: 4.2.1
elementType: Cl S O O O O O N N N N N N N C C C C C C C C C C C C C C C C H H H H H H H H H H H H H H H H H H
charge: 0
multiplicity: 1
keywords: wb97x-d3
keywords: def2-TZVPP
keywords: def2/J RIJCOSX GRIDX6 NOFINALGRIDX
keywords: grid4 nofinalgrid
keywords: scfconv7
keywords: smallprint printgap noloewdin
keywords: NOSOSCF
formula: C16H18ClN7O5S
InChI: InChI=1S/C16H18ClN7O5S/c1-4-5-9-6-7-10-18-13(17)14(24(10)22-9)30(26,27)23-16(25)21-15-19-11(28-2)8-12(20-15)29-3/h6-8,21,23H,4-5H2,1-3H3
48 atoms
Cl -4.755493 -1.293482 -1.171024
S  -1.918515 -1.003464 0.995001
O  -2.734067 -2.194487 0.985235
O  -1.629858 -0.33615 2.24735
O  -1.200492 -2.220669 -1.57955
O  3.360595 -0.195694 2.213811
O  5.587628 -2.3431 -1.249553
N  -2.103601 1.353992 -0.358565
N  -1.025787 1.867721 0.219406
N  -3.871801 1.134986 -1.687698
N  -0.424037 -1.31602 0.352485
N  1.034272 -2.099949 -1.276432
N  2.183047 -1.136037 0.497088
N  3.305089 -2.225399 -1.268913
C  -2.623477 0.106369 -0.124346
C  -0.704126 3.0743 -0.155534
C  0.481535 3.701609 0.500543
C  -2.888747 1.942951 -1.306843
C  0.072533 4.803347 1.480293
C  -1.450214 3.801051 -1.125957
C  -2.542281 3.242159 -1.708681
C  -3.7068 0.022905 -0.9784
C  1.27977 5.454031 2.13432
C  -0.264545 -1.899945 -0.877933
C  2.222478 -1.803725 -0.642715
C  3.349439 -0.86486 1.073358
C  4.460706 -1.948549 -0.681226
C  4.555811 -1.255929 0.52032
C  2.119573 0.210443 2.786153
C  5.529544 -3.06211 -2.479152
H  1.05227 2.93308 1.024175
H  1.134577 4.119948 -0.269612
H  -0.581873 4.378524 2.245167
H  -0.514179 5.562999 0.957387
H  -1.130159 4.797074 -1.397573
H  -3.131776 3.751956 -2.456537
H  1.871268 4.725601 2.691305
H  1.933996 5.913531 1.391744
H  0.974617 6.23347 2.832676
H  1.127518 -2.567839 -2.168325
H  5.504114 -1.038624 0.989113
H  1.500872 -0.645825 3.055687
H  1.564343 0.872034 2.120312
H  2.376073 0.756177 3.689346
H  4.987374 -4.001003 -2.372262
H  6.561802 -3.274832 -2.742344
H  5.073207 -2.470327 -3.271854
H  0.419578 -0.999924 0.851163
elementType: Cl S O N C H
totalener: -2238.50014111 hartree
nucrepener: 3486.75189773 hartree
electener: -5725.25203885 hartree
twoeener: 4280.17568483 hartree
cpcmener: -0.05408197 hartree
kineticenergy: 2231.43967703 hartree
xcener: -168.724530659366 hartree
chargesum: -0.0000000
charge: -0.019564 0.874010 -0.491899 -0.506652 -0.473802 -0.298790 -0.300406 0.231435 -0.324782 -0.321264 -0.208933 -0.137722 -0.431662 -0.426464 -0.207039 0.140028 -0.123029 0.217911 -0.090755 -0.101625 -0.152321 0.178651 -0.280948 0.383130 0.374470 0.427789 0.422531 -0.326700 -0.113919 -0.115273 0.097871 0.102571 0.077565 0.073533 0.163947 0.162541 0.081379 0.082937 0.093751 0.192619 0.148227 0.125675 0.077350 0.143407 0.114001 0.133171 0.114797 0.218250
qa: -0.0196 0.8740 -0.4919 -0.5067 -0.4738 -0.2988 -0.3004 0.2314 -0.3248 -0.3213 -0.2089 -0.1377 -0.4317 -0.4265 -0.2070 0.1400 -0.1230 0.2179 -0.0908 -0.1016 -0.1523 0.1787 -0.2809 0.3831 0.3745 0.4278 0.4225 -0.3267 -0.1139 -0.1153 0.0979 0.1026 0.0776 0.0735 0.1639 0.1625 0.0814 0.0829 0.0938 0.1926 0.1482 0.1257 0.0773 0.1434 0.1140 0.1332 0.1148 0.2183
va: 1.3016 5.8890 2.0087 1.9752 2.0449 2.1306 2.1209 3.4172 2.8651 3.1269 3.0751 3.1850 2.9743 2.9681 3.8432 3.9546 3.9026 3.9886 3.8571 3.9093 4.0535 4.2005 3.9458 4.3928 4.2471 3.9779 4.0134 3.9338 3.8483 3.8454 0.9949 1.0063 1.0090 1.0104 0.9879 1.0006 1.0012 1.0006 1.0031 1.0165 1.0152 0.9980 0.9847 0.9961 0.9957 0.9931 0.9952 1.0604
dispcorr: -0.026246340 hartree
energy: -2238.526387454050
dipole: 36.63917 -32.36605 4.27312 29.33424 -25.72371 3.61052 9.27948 -10.26420 -0.98472
magnitude: 5.68024 au
magnitude: 14.43801 debye
