program: Orca
programVersion: 4.2.1
elementType: Cl S O O O O O N N N N N N N C C C C C C C C C C C C C C C C H H H H H H H H H H H H H H H H H H
charge: 0
multiplicity: 1
keywords: wb97x-d3
keywords: def2-TZVPP
keywords: def2/J RIJCOSX GRIDX6 NOFINALGRIDX
keywords: grid4 nofinalgrid
keywords: scfconv7
keywords: smallprint printgap noloewdin
keywords: NOSOSCF
formula: C16H18ClN7O5S
InChI: InChI=1S/C16H18ClN7O5S/c1-4-5-9-6-7-10-18-13(17)14(24(10)22-9)30(26,27)23-16(25)21-15-19-11(28-2)8-12(20-15)29-3/h6-8,21,23H,4-5H2,1-3H3
48 atoms
Cl -5.21603 -0.302032 0.827798
S  -2.080004 -1.597698 -0.270919
O  -1.791389 -1.833524 -1.670815
O  -3.012716 -2.44756 0.427644
O  -1.281947 -0.952611 2.500263
O  3.045388 -1.747794 -1.968389
O  5.355867 0.141017 1.584222
N  -1.839569 1.13189 -0.284151
N  -0.56846 1.11339 -0.656611
N  -3.81857 1.891079 0.387438
N  -0.586787 -1.641445 0.449102
N  0.924766 -0.852179 2.026879
N  1.973597 -1.328916 0.00726
N  3.135602 -0.356044 1.815538
C  -2.620583 0.033334 -0.035229
C  0.006921 2.278145 -0.781814
C  1.442495 2.273383 -1.201841
C  -2.598238 2.234926 -0.009195
C  1.608397 2.042615 -2.704373
C  -0.683794 3.499459 -0.555137
C  -1.987098 3.486881 -0.166981
C  -3.827995 0.561938 0.379745
C  3.071874 1.981599 -3.108596
C  -0.379728 -1.139685 1.711361
C  2.056759 -0.849106 1.236428
C  3.081901 -1.296027 -0.726883
C  4.235827 -0.33985 1.074945
C  4.277487 -0.803719 -0.235427
C  1.801946 -2.198685 -2.503326
C  5.356461 0.643293 2.919468
H  1.899365 3.224234 -0.923637
H  1.974562 1.495084 -0.65098
H  1.104818 2.844049 -3.250583
H  1.106454 1.113433 -2.985648
H  -0.155044 4.43284 -0.68427
H  -2.546385 4.389647 0.03073
H  3.176223 1.84404 -4.184817
H  3.59873 2.898332 -2.839296
H  3.585167 1.151171 -2.619904
H  1.055098 -0.489888 2.962525
H  5.179593 -0.778646 -0.828635
H  1.067172 -1.393803 -2.540788
H  1.40181 -3.042305 -1.941351
H  2.018429 -2.521959 -3.517276
H  5.083835 -0.126131 3.640499
H  4.687005 1.495802 3.027941
H  6.376768 0.964472 3.108784
H  0.235602 -1.642923 -0.176094
elementType: Cl S O N C H
totalener: -2238.49878561 hartree
nucrepener: 3611.20947231 hartree
electener: -5849.70825792 hartree
twoeener: 4403.98182907 hartree
cpcmener: -0.05351048 hartree
kineticenergy: 2231.43466911 hartree
xcener: -168.723450998322 hartree
chargesum: 0.0000000
charge: -0.017690 0.871455 -0.505610 -0.486044 -0.463105 -0.294651 -0.297609 0.228735 -0.334464 -0.321683 -0.205284 -0.122351 -0.394657 -0.420062 -0.158693 0.144249 -0.083962 0.214371 -0.110022 -0.096635 -0.143909 0.137996 -0.272657 0.343232 0.338722 0.389062 0.448392 -0.330526 -0.117068 -0.116088 0.104456 0.046349 0.085947 0.077944 0.159769 0.162888 0.097860 0.089178 0.070162 0.195236 0.148848 0.088844 0.125932 0.143309 0.114889 0.115301 0.133530 0.216115
qa: -0.0177 0.8715 -0.5056 -0.4860 -0.4631 -0.2947 -0.2976 0.2287 -0.3345 -0.3217 -0.2053 -0.1224 -0.3947 -0.4201 -0.1587 0.1442 -0.0840 0.2144 -0.1100 -0.0966 -0.1439 0.1380 -0.2727 0.3432 0.3387 0.3891 0.4484 -0.3305 -0.1171 -0.1161 0.1045 0.0463 0.0859 0.0779 0.1598 0.1629 0.0979 0.0892 0.0702 0.1952 0.1488 0.0888 0.1259 0.1433 0.1149 0.1153 0.1335 0.2161
va: 1.3041 5.8867 1.9719 2.0107 2.0449 2.1151 2.1298 3.3972 2.8626 3.1308 3.0675 3.1834 2.9545 2.9615 3.8143 3.9467 3.8821 3.9844 3.8615 3.9154 4.0483 4.2511 3.9400 4.4218 4.2534 3.9644 3.9756 3.8994 3.8387 3.8456 1.0157 1.0358 1.0096 1.0062 0.9916 1.0000 1.0039 1.0010 1.0012 1.0144 1.0158 0.9959 0.9923 0.9960 0.9952 0.9950 0.9933 1.0729
dispcorr: -0.031216488 hartree
energy: -2238.530002094808
dipole: 45.62179 -40.57178 5.05001 15.46523 -11.87234 3.59289 -15.10480 14.38337 -0.72143
magnitude: 6.23955 au
magnitude: 15.85967 debye
