program: Orca
programVersion: 4.2.1
elementType: Cl S O O O O O N N N N N N N C C C C C C C C C C C C C C C C H H H H H H H H H H H H H H H H H H
charge: 0
multiplicity: 1
keywords: wb97x-d3
keywords: def2-TZVPP
keywords: def2/J RIJCOSX GRIDX6 NOFINALGRIDX
keywords: grid4 nofinalgrid
keywords: scfconv7
keywords: smallprint printgap noloewdin
keywords: NOSOSCF
formula: C16H18ClN7O5S
InChI: InChI=1S/C16H18ClN7O5S/c1-4-5-9-6-7-10-18-13(17)14(24(10)22-9)30(26,27)23-16(25)21-15-19-11(28-2)8-12(20-15)29-3/h6-8,21,23H,4-5H2,1-3H3
48 atoms
Cl -4.803781 -0.310517 1.660371
S  -1.99935 -1.468195 -0.231725
O  -1.77817 -1.723128 -1.639643
O  -2.812153 -2.371891 0.54629
O  -1.115679 -0.742938 2.48392
O  3.15633 -1.817909 -1.974812
O  5.610342 -0.245731 1.639444
N  -2.060771 1.244777 -0.522352
N  -0.978828 1.278671 -1.285654
N  -3.799376 1.922227 0.689841
N  -0.469388 -1.369105 0.399221
N  1.092345 -0.757532 2.005623
N  2.110951 -1.307069 -0.008076
N  3.347699 -0.50585 1.834538
C  -2.642277 0.118806 0.002889
C  -0.577964 2.466289 -1.652573
C  0.6436 2.535644 -2.519621
C  -2.790135 2.312875 -0.081377
C  1.856066 1.810613 -1.940389
C  -1.256494 3.653604 -1.26531
C  -2.366349 3.586592 -0.482633
C  -3.701819 0.599126 0.750613
C  2.285799 2.33441 -0.579759
C  -0.22949 -0.949056 1.682033
C  2.228994 -0.862602 1.231288
C  3.226794 -1.38614 -0.726741
C  4.452189 -0.591713 1.105548
C  4.461463 -1.031748 -0.213922
C  1.889052 -2.20746 -2.501352
C  5.640315 0.237081 2.981273
H  0.399452 2.112347 -3.49735
H  0.889015 3.584869 -2.690689
H  2.677805 1.912469 -2.6515
H  1.636589 0.744581 -1.876048
H  -0.875483 4.60758 -1.599694
H  -2.909507 4.463269 -0.1613
H  1.535921 2.14374 0.189692
H  3.214774 1.863198 -0.256269
H  2.462466 3.411366 -0.606819
H  1.244398 -0.432889 2.951566
H  5.368873 -1.094069 -0.796067
H  1.189114 -1.371289 -2.535647
H  1.452792 -3.031099 -1.936265
H  2.082264 -2.538789 -3.517399
H  6.683017 0.461099 3.187299
H  5.288842 -0.513366 3.688249
H  5.049722 1.145405 3.094842
H  0.339527 -1.462114 -0.232372
elementType: Cl S O N C H
totalener: -2238.49919129 hartree
nucrepener: 3607.59281667 hartree
electener: -5846.09200796 hartree
twoeener: 4400.92935155 hartree
cpcmener: -0.05335755 hartree
kineticenergy: 2231.43578297 hartree
xcener: -168.727338853777 hartree
chargesum: -0.0000000
charge: -0.018481 0.876927 -0.506742 -0.491284 -0.468989 -0.294323 -0.298483 0.233305 -0.326665 -0.319615 -0.206157 -0.124422 -0.401821 -0.413364 -0.204130 0.081929 -0.115771 0.225015 -0.027786 -0.052468 -0.159564 0.176945 -0.321020 0.371525 0.338449 0.386706 0.406287 -0.299942 -0.116857 -0.114878 0.103063 0.093150 0.088144 0.005659 0.156652 0.163313 0.087127 0.100866 0.109322 0.194002 0.145126 0.098413 0.124999 0.141818 0.133636 0.114457 0.114416 0.211511
qa: -0.0185 0.8769 -0.5067 -0.4913 -0.4690 -0.2943 -0.2985 0.2333 -0.3267 -0.3196 -0.2062 -0.1244 -0.4018 -0.4134 -0.2041 0.0819 -0.1158 0.2250 -0.0278 -0.0525 -0.1596 0.1769 -0.3210 0.3715 0.3384 0.3867 0.4063 -0.2999 -0.1169 -0.1149 0.1031 0.0932 0.0881 0.0057 0.1567 0.1633 0.0871 0.1009 0.1093 0.1940 0.1451 0.0984 0.1250 0.1418 0.1336 0.1145 0.1144 0.2115
va: 1.3029 5.8840 1.9744 2.0100 2.0484 2.1207 2.1204 3.4100 2.8524 3.1285 3.0688 3.1868 2.9268 2.9456 3.8360 3.9684 3.9004 3.9709 3.8329 3.8608 4.0565 4.2088 3.9607 4.3968 4.2470 3.9763 4.0124 3.9230 3.8401 3.8462 1.0116 1.0088 1.0124 1.0339 0.9918 1.0004 0.9958 1.0000 1.0030 1.0158 1.0172 0.9901 0.9902 0.9968 0.9932 0.9952 0.9953 1.0692
dispcorr: -0.031596966 hartree
energy: -2238.530788260194
dipole: 41.95859 -37.43093 4.52766 15.15800 -11.70857 3.44943 -12.64724 11.22955 -1.41768
magnitude: 5.86584 au
magnitude: 14.90978 debye
