program: Orca
programVersion: 4.2.1
elementType: Cl S O O O O O N N N N N N N C C C C C C C C C C C C C C C C H H H H H H H H H H H H H H H H H H
charge: 0
multiplicity: 1
keywords: wb97x-d3
keywords: def2-TZVPP
keywords: def2/J RIJCOSX GRIDX6 NOFINALGRIDX
keywords: grid4 nofinalgrid
keywords: scfconv7
keywords: smallprint printgap noloewdin
keywords: NOSOSCF
formula: C16H18ClN7O5S
InChI: InChI=1S/C16H18ClN7O5S/c1-4-5-9-6-7-10-18-13(17)14(24(10)22-9)30(26,27)23-16(25)21-15-19-11(28-2)8-12(20-15)29-3/h6-8,21,23H,4-5H2,1-3H3
48 atoms
Cl -1.58779 -1.395023 1.493734
S  -0.649614 -0.275558 -1.628531
O  -0.387096 0.610257 -2.732999
O  -1.212513 -1.589433 -1.855938
O  1.207123 1.571838 -0.290469
O  1.936947 -4.615565 0.418831
O  5.036625 -2.723369 3.310186
N  -2.121121 1.824304 -0.515336
N  -2.039211 2.654162 -1.544943
N  -2.664486 1.025612 1.493878
N  0.744614 -0.592835 -0.784906
N  2.453969 -0.043722 0.683522
N  2.177555 -2.347109 0.523265
N  3.750274 -1.379952 1.988772
C  -1.614148 0.552022 -0.441886
C  -2.608151 3.816464 -1.391908
C  -2.560696 4.752179 -2.557573
C  -2.750871 2.067852 0.67624
C  -3.930799 4.924185 -3.221011
C  -3.284945 4.192937 -0.197212
C  -3.36119 3.321775 0.84112
C  -1.98146 0.114537 0.815724
C  -4.500215 3.6276 -3.774423
C  1.452667 0.39372 -0.150408
C  2.801947 -1.319788 1.073886
C  2.536377 -3.559362 0.934933
C  4.099479 -2.59403 2.390208
C  3.519047 -3.754557 1.890185
C  0.911699 -4.424693 -0.552518
C  5.628204 -1.549466 3.860836
H  -2.198454 5.725482 -2.216415
H  -1.841074 4.374925 -3.285915
H  -3.820064 5.651515 -4.028552
H  -4.635091 5.367154 -2.510969
H  -3.731702 5.175233 -0.128149
H  -3.862062 3.555632 1.769702
H  -5.433272 3.811024 -4.309228
H  -3.807037 3.154204 -4.472536
H  -4.71846 2.903366 -2.987059
H  2.966936 0.697612 1.142804
H  3.810076 -4.738816 2.22703
H  1.28655 -3.920201 -1.443876
H  0.063686 -3.874361 -0.142339
H  0.578558 -5.421639 -0.828498
H  6.345329 -1.90138 4.59793
H  4.888707 -0.918164 4.353829
H  6.150495 -0.965914 3.10241
H  0.983959 -1.570823 -0.564056
elementType: Cl S O N C H
totalener: -2238.49942230 hartree
nucrepener: 3470.84360552 hartree
electener: -5709.34302783 hartree
oneelecener: -9974.56323433 hartree
twoeener: 4265.22020650 hartree
cpcmener: -0.04174598 hartree
kineticenergy: 2231.43200765 hartree
xcener: -168.720430604625 hartree
chargesum: 0.0000000
charge: -0.032803 0.851926 -0.459793 -0.492920 -0.450573 -0.288233 -0.290864 0.209666 -0.268211 -0.317852 -0.222436 -0.134886 -0.423344 -0.423841 -0.149589 0.083767 -0.120025 0.225599 -0.110486 -0.068363 -0.170437 0.138638 -0.265891 0.353773 0.367347 0.416186 0.412405 -0.320436 -0.117526 -0.115313 0.104688 0.090476 0.077868 0.067403 0.159287 0.160584 0.094834 0.085968 0.081645 0.190868 0.145426 0.117190 0.099674 0.138711 0.131270 0.113459 0.113499 0.211665
qa: -0.0328 0.8519 -0.4598 -0.4929 -0.4506 -0.2882 -0.2909 0.2097 -0.2682 -0.3179 -0.2224 -0.1349 -0.4233 -0.4238 -0.1496 0.0838 -0.1200 0.2256 -0.1105 -0.0684 -0.1704 0.1386 -0.2659 0.3538 0.3673 0.4162 0.4124 -0.3204 -0.1175 -0.1153 0.1047 0.0905 0.0779 0.0674 0.1593 0.1606 0.0948 0.0860 0.0816 0.1909 0.1454 0.1172 0.0997 0.1387 0.1313 0.1135 0.1135 0.2117
va: 1.2936 5.9274 2.0390 1.9939 2.0621 2.1420 2.1323 3.4774 2.8893 3.1353 3.0599 3.1781 2.9731 2.9682 3.7947 3.9624 3.8663 3.9673 3.8852 3.8595 4.0643 4.2158 3.9266 4.4191 4.2488 3.9991 4.0284 3.9295 3.8474 3.8490 1.0063 1.0231 1.0096 1.0087 0.9898 1.0020 1.0042 1.0030 1.0013 1.0178 1.0160 0.9902 0.9980 0.9967 0.9935 0.9958 0.9955 1.0729
dispcorr: -0.026756135 hartree
energy: -2238.526178437702
dipole: -3.78832 4.14281 0.35449 18.04533 -16.65824 1.38710 -11.11232 12.77737 1.66505
magnitude: 2.19593 au
magnitude: 5.58161 debye
