program: Orca
programVersion: 4.2.1
elementType: Cl S O O O O O N N N N N N N C C C C C C C C C C C C C C C C H H H H H H H H H H H H H H H H H H
charge: 0
multiplicity: 1
keywords: wb97x-d3
keywords: def2-TZVPP
keywords: def2/J RIJCOSX GRIDX6 NOFINALGRIDX
keywords: grid4 nofinalgrid
keywords: scfconv7
keywords: smallprint printgap noloewdin
keywords: NOSOSCF
formula: C16H18ClN7O5S
InChI: InChI=1S/C16H18ClN7O5S/c1-4-5-9-6-7-10-18-13(17)14(24(10)22-9)30(26,27)23-16(25)21-15-19-11(28-2)8-12(20-15)29-3/h6-8,21,23H,4-5H2,1-3H3
48 atoms
Cl 0.804474 0.244326 -2.344043
S  -1.539847 -0.891388 -0.08132
O  -1.607856 -1.857911 -1.156165
O  -2.539832 -0.876388 0.9543
O  -0.066524 0.684177 1.921021
O  2.804326 -4.018553 -1.069372
O  6.185875 -1.879175 1.284203
N  -2.132704 1.813348 -0.448927
N  -3.194049 1.862033 0.342258
N  -0.548096 2.472917 -1.871546
N  -0.028993 -1.133251 0.563991
N  1.883085 -0.434331 1.675921
N  2.319715 -2.246443 0.286358
N  4.030925 -1.157938 1.487138
C  -1.390165 0.70343 -0.76025
C  -3.755013 3.030063 0.478831
C  -4.988134 3.092145 1.321585
C  -1.588648 2.860645 -1.144024
C  -6.254317 3.249316 0.472597
C  -3.271333 4.199154 -0.173529
C  -2.189255 4.12047 -0.989777
C  -0.434917 1.17269 -1.641138
C  -6.483871 2.095104 -0.490241
C  0.545591 -0.237337 1.427368
C  2.775635 -1.326155 1.118956
C  3.212323 -3.085088 -0.230938
C  4.911478 -1.999513 0.96389
C  4.559439 -3.013466 0.079734
C  1.422103 -4.086479 -1.410436
C  6.579362 -0.824984 2.158526
H  -5.05515 2.182794 1.920808
H  -4.908336 3.934055 2.013342
H  -6.215407 4.1922 -0.080184
H  -7.103427 3.334069 1.154086
H  -3.774239 5.142444 -0.011615
H  -1.782827 4.974675 -1.512053
H  -7.434155 2.210722 -1.012869
H  -5.704665 2.030668 -1.251508
H  -6.510022 1.137568 0.033255
H  2.29277 0.239023 2.310386
H  5.286341 -3.69254 -0.341229
H  0.795709 -4.259896 -0.534749
H  1.326386 -4.934631 -2.083001
H  1.090741 -3.187613 -1.932308
H  6.114214 -0.918174 3.13983
H  6.343323 0.153938 1.740813
H  7.657199 -0.918338 2.262763
H  0.580372 -1.853982 0.149367
elementType: Cl S O N C H
totalener: -2238.49879735 hartree
nucrepener: 3477.85867747 hartree
electener: -5716.35747482 hartree
oneelecener: -9988.61556390 hartree
twoeener: 4272.25808908 hartree
cpcmener: -0.04165771 hartree
kineticenergy: 2231.44362132 hartree
xcener: -168.722562305426 hartree
chargesum: -0.0000000
charge: -0.032327 0.854083 -0.494405 -0.459101 -0.448827 -0.287967 -0.290987 0.211326 -0.270864 -0.316784 -0.223998 -0.133938 -0.423637 -0.422865 -0.154127 0.083119 -0.117265 0.225115 -0.110201 -0.065120 -0.172187 0.141356 -0.263415 0.348969 0.364333 0.417169 0.413747 -0.320567 -0.116548 -0.115899 0.089559 0.102986 0.068310 0.077214 0.159851 0.160229 0.094288 0.080857 0.084482 0.191361 0.145313 0.115890 0.138792 0.101080 0.113200 0.113788 0.131675 0.212939
qa: -0.0323 0.8541 -0.4944 -0.4591 -0.4488 -0.2880 -0.2910 0.2113 -0.2709 -0.3168 -0.2240 -0.1339 -0.4236 -0.4229 -0.1541 0.0831 -0.1173 0.2251 -0.1102 -0.0651 -0.1722 0.1414 -0.2634 0.3490 0.3643 0.4172 0.4137 -0.3206 -0.1165 -0.1159 0.0896 0.1030 0.0683 0.0772 0.1599 0.1602 0.0943 0.0809 0.0845 0.1914 0.1453 0.1159 0.1388 0.1011 0.1132 0.1138 0.1317 0.2129
va: 1.2952 5.9225 1.9913 2.0396 2.0623 2.1420 2.1323 3.4762 2.8848 3.1350 3.0581 3.1786 2.9699 2.9702 3.7996 3.9643 3.8743 3.9667 3.8863 3.8570 4.0648 4.2135 3.9263 4.4217 4.2503 3.9965 4.0269 3.9318 3.8468 3.8489 1.0232 1.0070 1.0083 1.0099 0.9889 1.0019 1.0046 1.0020 1.0034 1.0176 1.0162 0.9901 0.9959 0.9989 0.9956 0.9957 0.9934 1.0727
dispcorr: -0.026940108 hartree
energy: -2238.525737459178
dipole: -16.72341 17.74093 1.01752 8.79254 -6.93652 1.85602 8.99252 -8.57753 0.41499
magnitude: 2.15693 au
magnitude: 5.48249 debye
