program: Orca
programVersion: 4.2.1
elementType: Cl S O O O O O N N N N N N N C C C C C C C C C C C C C C C C H H H H H H H H H H H H H H H H H H
charge: 0
multiplicity: 1
keywords: wb97x-d3
keywords: def2-TZVPP
keywords: def2/J RIJCOSX GRIDX6 NOFINALGRIDX
keywords: grid4 nofinalgrid
keywords: scfconv7
keywords: smallprint printgap noloewdin
keywords: NOSOSCF
formula: C16H18ClN7O5S
InChI: InChI=1S/C16H18ClN7O5S/c1-4-5-9-6-7-10-18-13(17)14(24(10)22-9)30(26,27)23-16(25)21-15-19-11(28-2)8-12(20-15)29-3/h6-8,21,23H,4-5H2,1-3H3
48 atoms
Cl -4.798565 -0.370992 1.66299
S  -1.954137 -1.489005 -0.216956
O  -1.734383 -1.760055 -1.621838
O  -2.727448 -2.399863 0.590012
O  -1.044994 -0.736384 2.498391
O  3.175402 -1.762208 -2.020061
O  5.70801 -0.717661 1.729053
N  -2.12392 1.205077 -0.589272
N  -1.046402 1.247792 -1.361753
N  -3.887278 1.858671 0.593043
N  -0.424139 -1.312007 0.391351
N  1.160672 -0.816507 2.011407
N  2.155017 -1.30302 -0.031332
N  3.432049 -0.772048 1.877024
C  -2.653289 0.079405 -0.014243
C  -0.709164 2.42933 -1.797756
C  0.512174 2.522183 -2.655236
C  -2.89967 2.259097 -0.196795
C  1.67508 3.228797 -1.953297
C  -1.442815 3.605916 -1.471394
C  -2.538543 3.530273 -0.672121
C  -3.734236 0.543658 0.712233
C  2.177007 2.487947 -0.725181
C  -0.171437 -0.946065 1.687535
C  2.292763 -0.979067 1.243415
C  3.268979 -1.441826 -0.743006
C  4.535489 -0.913153 1.156225
C  4.525124 -1.257765 -0.191574
C  1.882795 -1.940137 -2.593416
C  5.750518 -0.346882 3.103689
H  0.814319 1.516583 -2.953628
H  0.256708 3.06563 -3.568597
H  1.383768 4.247654 -1.682756
H  2.487693 3.330852 -2.675802
H  -1.118455 4.557006 -1.870414
H  -3.125936 4.395183 -0.398864
H  2.475671 1.469323 -0.978739
H  3.045806 2.98775 -0.294693
H  1.419893 2.42175 0.058572
H  1.330471 -0.554124 2.973715
H  5.431975 -1.368705 -0.767784
H  2.05543 -2.189241 -3.637177
H  1.288338 -1.025844 -2.544812
H  1.339707 -2.759915 -2.12153
H  6.804876 -0.243478 3.346723
H  5.308939 -1.111157 3.743549
H  5.247279 0.603987 3.281047
H  0.378166 -1.411369 -0.246692
elementType: Cl S O N C H
totalener: -2238.50223106 hartree
nucrepener: 3566.17840439 hartree
electener: -5804.68063545 hartree
twoeener: 4359.43630291 hartree
cpcmener: -0.04431437 hartree
kineticenergy: 2231.44038734 hartree
xcener: -168.723518808368 hartree
chargesum: 0.0000000
charge: -0.016722 0.866042 -0.497281 -0.476824 -0.446223 -0.288156 -0.289909 0.227136 -0.304747 -0.314052 -0.208572 -0.135520 -0.410118 -0.418495 -0.201676 0.098201 -0.148457 0.216691 -0.102711 -0.072146 -0.162513 0.175793 -0.257792 0.365392 0.348775 0.385431 0.411421 -0.302018 -0.106466 -0.116738 0.104466 0.113742 0.069818 0.078801 0.157654 0.161010 0.065385 0.101593 0.082056 0.189884 0.143990 0.139394 0.081091 0.120851 0.131780 0.114142 0.113096 0.213501
qa: -0.0167 0.8660 -0.4973 -0.4768 -0.4462 -0.2882 -0.2899 0.2271 -0.3047 -0.3141 -0.2086 -0.1355 -0.4101 -0.4185 -0.2017 0.0982 -0.1485 0.2167 -0.1027 -0.0721 -0.1625 0.1758 -0.2578 0.3654 0.3488 0.3854 0.4114 -0.3020 -0.1065 -0.1167 0.1045 0.1137 0.0698 0.0788 0.1577 0.1610 0.0654 0.1016 0.0821 0.1899 0.1440 0.1394 0.0811 0.1209 0.1318 0.1141 0.1131 0.2135
va: 1.3035 5.9003 1.9852 2.0277 2.0766 2.1318 2.1333 3.4153 2.8629 3.1305 3.0681 3.1776 2.9383 2.9540 3.8423 3.9447 3.9003 3.9884 3.8898 3.8677 4.0661 4.2035 3.9370 4.4070 4.2489 3.9934 4.0264 3.9220 3.8467 3.8497 1.0039 1.0056 1.0099 1.0096 0.9914 1.0016 0.9992 1.0048 1.0029 1.0183 1.0168 0.9966 0.9922 0.9960 0.9934 0.9955 0.9957 1.0657
dispcorr: -0.029550490 hartree
energy: -2238.531781552127
dipole: 41.16405 -36.96254 4.20152 17.42149 -14.12528 3.29620 -13.24503 11.77455 -1.47048
magnitude: 5.53895 au
magnitude: 14.07890 debye
