program: Orca
programVersion: 4.2.1
elementType: Cl S O O O O O N N N N N N N C C C C C C C C C C C C C C C C H H H H H H H H H H H H H H H H H H
charge: 0
multiplicity: 1
keywords: wb97x-d3
keywords: def2-TZVPP
keywords: def2/J RIJCOSX GRIDX6 NOFINALGRIDX
keywords: grid4 nofinalgrid
keywords: scfconv7
keywords: smallprint printgap noloewdin
keywords: NOSOSCF
formula: C16H18ClN7O5S
InChI: InChI=1S/C16H18ClN7O5S/c1-4-5-9-6-7-10-18-13(17)14(24(10)22-9)30(26,27)23-16(25)21-15-19-11(28-2)8-12(20-15)29-3/h6-8,21,23H,4-5H2,1-3H3
48 atoms
Cl -4.717197 -1.486156 -1.001542
S  -1.897901 -0.833312 1.105133
O  -2.597646 -2.094002 1.138855
O  -1.618755 -0.114684 2.329023
O  -1.147153 -1.991427 -1.505768
O  3.352367 -0.297848 2.531568
O  5.568616 -2.646418 -0.803938
N  -2.426769 1.493045 -0.229834
N  -1.415893 2.149439 0.321917
N  -4.195994 1.046493 -1.498123
N  -0.405185 -1.017036 0.404975
N  1.077706 -1.956195 -1.115976
N  2.20037 -1.098938 0.73046
N  3.320454 -2.293057 -0.966312
C  -2.759579 0.183505 0.002043
C  -1.292957 3.399197 -0.027617
C  -0.158604 4.16735 0.570735
C  -3.325067 1.979545 -1.137978
C  0.920027 4.516138 -0.456526
C  -2.177467 4.030459 -0.948286
C  -3.192626 3.326402 -1.512354
C  -3.85176 -0.041327 -0.816582
C  2.036822 5.345174 0.156181
C  -0.227966 -1.678439 -0.783186
C  2.245392 -1.768355 -0.409001
C  3.347815 -0.951928 1.38515
C  4.457983 -2.136922 -0.304589
C  4.543546 -1.461127 0.907653
C  2.124163 0.215235 3.039863
C  5.504741 -3.363589 -2.03388
H  -0.552567 5.088585 1.010013
H  0.274797 3.584271 1.384957
H  0.475828 5.066646 -1.290402
H  1.328006 3.59425 -0.878696
H  -2.032226 5.074626 -1.188115
H  -3.887599 3.759531 -2.217434
H  2.530317 4.812875 0.971413
H  2.798108 5.588281 -0.585911
H  1.657346 6.286508 0.558275
H  1.186366 -2.448399 -1.993224
H  5.475628 -1.345218 1.441215
H  2.375641 0.704232 3.977187
H  1.405408 -0.580168 3.241484
H  1.683857 0.952156 2.366781
H  4.858348 -4.238181 -1.958091
H  6.522045 -3.688021 -2.236832
H  5.159596 -2.73221 -2.852681
H  0.431095 -0.759023 0.945889
elementType: Cl S O N C H
totalener: -2238.50257168 hartree
nucrepener: 3462.82589766 hartree
electener: -5701.32846934 hartree
oneelecener: -9957.75945643 hartree
twoeener: 4256.43098708 hartree
cpcmener: -0.04391872 hartree
kineticenergy: 2231.43577782 hartree
xcener: -168.720192241275 hartree
chargesum: -0.0000000
charge: -0.017030 0.868560 -0.477809 -0.494730 -0.451268 -0.290561 -0.291618 0.227482 -0.309864 -0.314620 -0.211988 -0.143340 -0.434661 -0.425797 -0.203215 0.141196 -0.122716 0.210003 -0.087479 -0.114003 -0.149654 0.174463 -0.280116 0.378546 0.373108 0.422532 0.415047 -0.324218 -0.120433 -0.116162 0.099497 0.088993 0.069873 0.074841 0.159862 0.160421 0.082210 0.093605 0.081941 0.189233 0.145093 0.139124 0.113392 0.104948 0.113489 0.132091 0.112933 0.208801
qa: -0.0170 0.8686 -0.4778 -0.4947 -0.4513 -0.2906 -0.2916 0.2275 -0.3099 -0.3146 -0.2120 -0.1433 -0.4347 -0.4258 -0.2032 0.1412 -0.1227 0.2100 -0.0875 -0.1140 -0.1497 0.1745 -0.2801 0.3785 0.3731 0.4225 0.4150 -0.3242 -0.1204 -0.1162 0.0995 0.0890 0.0699 0.0748 0.1599 0.1604 0.0822 0.0936 0.0819 0.1892 0.1451 0.1391 0.1134 0.1049 0.1135 0.1321 0.1129 0.2088
va: 1.3034 5.8997 2.0270 1.9898 2.0738 2.1402 2.1308 3.4238 2.8724 3.1282 3.0728 3.1772 2.9703 2.9654 3.8550 3.9518 3.8715 3.9965 3.8579 3.9047 4.0544 4.1990 3.9437 4.3979 4.2473 3.9892 4.0257 3.9302 3.8483 3.8495 1.0042 1.0173 1.0109 1.0091 0.9895 1.0017 1.0010 1.0034 1.0011 1.0189 1.0164 0.9958 0.9968 0.9921 0.9958 0.9932 0.9957 1.0668
dispcorr: -0.025326660 hartree
energy: -2238.527898344133
dipole: 38.44458 -34.79976 3.64482 28.81230 -25.43176 3.38055 2.06660 -2.95420 -0.88759
magnitude: 5.04981 au
magnitude: 12.83561 debye
