program: Orca
programVersion: 4.2.1
elementType: Cl S O O O O O N N N N N N N C C C C C C C C C C C C C C C C H H H H H H H H H H H H H H H H H H
charge: 0
multiplicity: 1
keywords: wb97x-d3
keywords: def2-TZVPP
keywords: def2/J RIJCOSX GRIDX6 NOFINALGRIDX
keywords: grid4 nofinalgrid
keywords: scfconv7
keywords: smallprint printgap noloewdin
keywords: NOSOSCF
formula: C16H18ClN7O5S
InChI: InChI=1S/C16H18ClN7O5S/c1-4-5-9-6-7-10-18-13(17)14(24(10)22-9)30(26,27)23-16(25)21-15-19-11(28-2)8-12(20-15)29-3/h6-8,21,23H,4-5H2,1-3H3
48 atoms
Cl -4.657847 -1.353808 -1.492491
S  -1.968514 -1.060431 0.854017
O  -2.661607 -2.307943 0.646481
O  -1.772848 -0.540457 2.18956
O  -1.043926 -1.820918 -1.845919
O  3.183533 -0.569199 2.620248
O  5.666365 -2.239569 -0.929824
N  -2.400016 1.442753 -0.152084
N  -1.418138 1.99328 0.548282
N  -4.082189 1.214335 -1.585643
N  -0.433521 -1.139356 0.231221
N  1.157912 -1.744118 -1.346874
N  2.154943 -1.132252 0.661858
N  3.409433 -1.982937 -1.144006
C  -2.759503 0.119979 -0.132639
C  -1.25491 3.275916 0.383657
C  -0.143599 3.926947 1.142394
C  -3.22937 2.070143 -1.038952
C  1.002257 4.364122 0.227553
C  -2.070488 4.048969 -0.491465
C  -3.056222 3.452942 -1.210718
C  -3.794561 0.034142 -1.046017
C  2.114466 5.053171 1.000744
C  -0.173751 -1.586562 -1.038116
C  2.283936 -1.609548 -0.564566
C  3.264289 -1.03374 1.38722
C  4.508381 -1.876292 -0.411043
C  4.505483 -1.400605 0.895763
C  1.904924 -0.222183 3.144507
C  5.696505 -2.741131 -2.263467
H  -0.540002 4.799049 1.670242
H  0.225436 3.233741 1.900274
H  0.623621 5.040206 -0.543961
H  1.398793 3.490646 -0.296235
H  -1.894969 5.112564 -0.573847
H  -3.697649 3.995009 -1.890708
H  1.74813 5.942563 1.516924
H  2.549822 4.391124 1.751433
H  2.91813 5.367945 0.334203
H  1.328961 -2.08575 -2.283653
H  5.406803 -1.325216 1.486271
H  2.086945 0.125954 4.157866
H  1.236891 -1.083485 3.183733
H  1.438114 0.583326 2.575458
H  5.106687 -3.652142 -2.36573
H  6.739959 -2.966153 -2.468079
H  5.342179 -2.001659 -2.981657
H  0.364825 -0.920733 0.842001
elementType: Cl S O N C H
totalener: -2238.50280481 hartree
nucrepener: 3475.36570679 hartree
electener: -5713.86851160 hartree
oneelecener: -9982.73643547 hartree
twoeener: 4268.86792387 hartree
cpcmener: -0.04413587 hartree
kineticenergy: 2231.43957907 hartree
xcener: -168.721348385660 hartree
chargesum: -0.0000000
charge: -0.017009 0.867956 -0.477507 -0.495332 -0.450766 -0.290694 -0.291431 0.224984 -0.307809 -0.315280 -0.212393 -0.144695 -0.433938 -0.426091 -0.203831 0.140678 -0.124604 0.210651 -0.089627 -0.113918 -0.149785 0.175849 -0.278410 0.377967 0.373136 0.422457 0.415367 -0.325298 -0.116418 -0.116243 0.101512 0.088634 0.071015 0.074673 0.160863 0.160661 0.081911 0.082238 0.093317 0.189452 0.144987 0.139193 0.116493 0.097224 0.114084 0.131792 0.112766 0.211220
qa: -0.0170 0.8680 -0.4775 -0.4953 -0.4508 -0.2907 -0.2914 0.2250 -0.3078 -0.3153 -0.2124 -0.1447 -0.4339 -0.4261 -0.2038 0.1407 -0.1246 0.2107 -0.0896 -0.1139 -0.1498 0.1758 -0.2784 0.3780 0.3731 0.4225 0.4154 -0.3253 -0.1164 -0.1162 0.1015 0.0886 0.0710 0.0747 0.1609 0.1607 0.0819 0.0822 0.0933 0.1895 0.1450 0.1392 0.1165 0.0972 0.1141 0.1318 0.1128 0.2112
va: 1.3033 5.9004 2.0267 1.9890 2.0738 2.1398 2.1311 3.4275 2.8755 3.1279 3.0742 3.1773 2.9691 2.9656 3.8510 3.9506 3.8736 3.9972 3.8584 3.9033 4.0523 4.1982 3.9444 4.3994 4.2466 3.9883 4.0254 3.9297 3.8492 3.8493 1.0044 1.0156 1.0105 1.0090 0.9893 1.0016 1.0012 1.0011 1.0034 1.0188 1.0164 0.9960 0.9966 0.9926 0.9957 0.9932 0.9958 1.0643
dispcorr: -0.025633348 hartree
energy: -2238.528438156136
dipole: 38.73818 -35.00569 3.73249 28.09628 -24.52803 3.56825 8.18742 -8.38659 -0.19917
magnitude: 5.16755 au
magnitude: 13.13487 debye
