program: Orca
programVersion: 4.2.1
elementType: Cl S O O O O O N N N N N N N C C C C C C C C C C C C C C C C H H H H H H H H H H H H H H H H H H
charge: 0
multiplicity: 1
keywords: wb97x-d3
keywords: def2-TZVPP
keywords: def2/J RIJCOSX GRIDX6 NOFINALGRIDX
keywords: grid4 nofinalgrid
keywords: scfconv7
keywords: smallprint printgap noloewdin
keywords: NOSOSCF
formula: C16H18ClN7O5S
InChI: InChI=1S/C16H18ClN7O5S/c1-4-5-9-6-7-10-18-13(17)14(24(10)22-9)30(26,27)23-16(25)21-15-19-11(28-2)8-12(20-15)29-3/h6-8,21,23H,4-5H2,1-3H3
48 atoms
Cl -4.742976 -1.403247 -0.659298
S  -1.747829 -0.709082 1.177792
O  -2.511758 -1.912385 1.398745
O  -1.361922 0.128423 2.292171
O  -1.207861 -2.185828 -1.324742
O  3.588751 -0.30498 2.256824
O  5.533782 -2.919756 -1.050493
N  -2.189072 1.449725 -0.435679
N  -1.098559 2.087126 -0.034031
N  -4.05451 0.978383 -1.54733
N  -0.309612 -1.057636 0.428343
N  1.038617 -2.189222 -1.085101
N  2.302507 -1.215906 0.605627
N  3.283143 -2.548126 -1.074041
C  -2.609644 0.220573 0.000583
C  -0.88889 3.251544 -0.581261
C  0.306388 4.01855 -0.115716
C  -3.093532 1.874734 -1.36845
C  -0.084704 5.167372 0.817634
C  -1.762611 3.811863 -1.556095
C  -2.865681 3.128548 -1.957682
C  -3.759082 -0.02569 -0.728239
C  1.122332 5.979011 1.257393
C  -0.233645 -1.83733 -0.696635
C  2.257019 -1.96741 -0.481442
C  3.495479 -1.039582 1.164202
C  4.467423 -2.360681 -0.50975
C  4.647903 -1.600485 0.640648
C  2.405251 0.264461 2.809774
C  5.374034 -3.717908 -2.220252
H  0.990836 3.340903 0.397257
H  0.835797 4.417964 -0.98498
H  -0.598073 4.759064 1.691802
H  -0.80265 5.823185 0.317276
H  -1.531208 4.780962 -1.975838
H  -3.553055 3.506696 -2.700828
H  0.828825 6.784589 1.93135
H  1.85043 5.359039 1.783618
H  1.62953 6.432273 0.403635
H  1.075049 -2.758162 -1.920782
H  5.617558 -1.459961 1.095318
H  1.68824 -0.501462 3.107743
H  1.934118 0.966711 2.120698
H  2.726125 0.806289 3.695305
H  6.370459 -4.072002 -2.471465
H  4.978743 -3.137907 -3.054284
H  4.724658 -4.574617 -2.039366
H  0.569476 -0.793247 0.89387
elementType: Cl S O N C H
totalener: -2238.50273401 hartree
nucrepener: 3457.06260809 hartree
electener: -5695.56534210 hartree
oneelecener: -9946.25221099 hartree
twoeener: 4250.68686889 hartree
cpcmener: -0.04368914 hartree
kineticenergy: 2231.44185556 hartree
xcener: -168.721514646002 hartree
chargesum: -0.0000000
charge: -0.017289 0.867122 -0.478343 -0.493957 -0.451216 -0.290190 -0.291686 0.225184 -0.311148 -0.314925 -0.211289 -0.141810 -0.432812 -0.425322 -0.203529 0.132477 -0.113871 0.213745 -0.094511 -0.103735 -0.156712 0.177184 -0.278664 0.378245 0.371822 0.421042 0.415530 -0.324662 -0.119258 -0.116407 0.091114 0.095057 0.077626 0.072133 0.161489 0.160034 0.093382 0.081668 0.081020 0.188611 0.145311 0.113432 0.102751 0.139179 0.131837 0.113354 0.113644 0.207346
qa: -0.0173 0.8671 -0.4783 -0.4940 -0.4512 -0.2902 -0.2917 0.2252 -0.3111 -0.3149 -0.2113 -0.1418 -0.4328 -0.4253 -0.2035 0.1325 -0.1139 0.2137 -0.0945 -0.1037 -0.1567 0.1772 -0.2787 0.3782 0.3718 0.4210 0.4155 -0.3247 -0.1193 -0.1164 0.0911 0.0951 0.0776 0.0721 0.1615 0.1600 0.0934 0.0817 0.0810 0.1886 0.1453 0.1134 0.1028 0.1392 0.1318 0.1134 0.1136 0.2073
va: 1.3031 5.8984 2.0263 1.9901 2.0737 2.1413 2.1310 3.4242 2.8655 3.1270 3.0712 3.1770 2.9729 2.9661 3.8542 3.9524 3.8874 3.9909 3.8577 3.9021 4.0589 4.1968 3.9456 4.3982 4.2484 3.9919 4.0253 3.9289 3.8528 3.8491 1.0109 1.0055 1.0097 1.0099 0.9882 1.0017 1.0033 1.0012 1.0010 1.0193 1.0163 0.9971 0.9881 0.9955 0.9933 0.9956 0.9957 1.0695
dispcorr: -0.025353203 hartree
energy: -2238.528087218028
dipole: 35.32650 -31.55361 3.77289 29.98742 -26.90830 3.07912 3.46375 -4.92527 -1.46152
magnitude: 5.08446 au
magnitude: 12.92367 debye
