program: Orca
programVersion: 4.2.1
elementType: Cl S O O O O O N N N N N N N C C C C C C C C C C C C C C C C H H H H H H H H H H H H H H H H H H
charge: 0
multiplicity: 1
keywords: wb97x-d3
keywords: def2-TZVPP
keywords: def2/J RIJCOSX GRIDX6 NOFINALGRIDX
keywords: grid4 nofinalgrid
keywords: scfconv7
keywords: smallprint printgap noloewdin
keywords: NOSOSCF
formula: C16H18ClN7O5S
InChI: InChI=1S/C16H18ClN7O5S/c1-4-5-9-6-7-10-18-13(17)14(24(10)22-9)30(26,27)23-16(25)21-15-19-11(28-2)8-12(20-15)29-3/h6-8,21,23H,4-5H2,1-3H3
48 atoms
Cl -4.778515 -0.595947 1.661196
S  -1.90308 -1.348779 -0.340988
O  -1.658736 -1.505391 -1.757977
O  -2.605606 -2.372138 0.394669
O  -1.073683 -0.672427 2.416053
O  3.282286 -1.896365 -1.929411
O  5.65998 -1.44151 2.032505
N  -2.33301 1.335851 -0.574872
N  -1.281049 1.52393 -1.359024
N  -4.130197 1.75366 0.662344
N  -0.392449 -1.097873 0.293256
N  1.143335 -0.847438 2.014247
N  2.199377 -1.360848 0.007945
N  3.399486 -1.13295 2.024176
C  -2.731417 0.138837 -0.039607
C  -1.081458 2.749921 -1.754427
C  0.115254 3.004071 -2.613054
C  -3.2082 2.285811 -0.12923
C  1.204952 3.779165 -1.868905
C  -1.934811 3.82689 -1.379501
C  -2.998913 3.604039 -0.565178
C  -3.838903 0.458501 0.724708
C  2.401626 4.072602 -2.758451
C  -0.176845 -0.86746 1.626738
C  2.292517 -1.127371 1.306005
C  3.327928 -1.645356 -0.634127
C  4.518168 -1.412947 1.370984
C  4.553686 -1.688675 0.008038
C  2.020773 -1.885298 -2.591521
C  5.651921 -1.180166 3.433406
H  0.511025 2.050018 -2.965106
H  -0.196119 3.569554 -3.496031
H  1.522357 3.204096 -0.99503
H  0.796822 4.719116 -1.486904
H  -1.725821 4.820097 -1.752156
H  -3.673659 4.388005 -0.252326
H  2.858101 3.153526 -3.130683
H  2.115857 4.673905 -3.623713
H  3.169036 4.624356 -2.214388
H  1.283117 -0.66614 2.999718
H  5.471156 -1.924019 -0.51146
H  1.554148 -0.90059 -2.556774
H  1.341679 -2.632931 -2.181416
H  2.229956 -2.135582 -3.627818
H  5.296891 -0.173393 3.653989
H  6.686137 -1.272975 3.754344
H  5.042025 -1.902534 3.976204
H  0.428298 -1.235993 -0.312761
elementType: Cl S O N C H
totalener: -2238.50296747 hartree
nucrepener: 3479.14495433 hartree
electener: -5717.64792180 hartree
oneelecener: -9990.29948809 hartree
twoeener: 4272.65156630 hartree
cpcmener: -0.04403943 hartree
kineticenergy: 2231.44051624 hartree
xcener: -168.721539532032 hartree
chargesum: -0.0000000
charge: -0.017170 0.865560 -0.496503 -0.478769 -0.451493 -0.290082 -0.291731 0.226779 -0.310610 -0.314675 -0.209642 -0.144026 -0.431453 -0.425035 -0.195870 0.140899 -0.121648 0.211157 -0.091814 -0.112738 -0.151847 0.171518 -0.277366 0.376759 0.371719 0.418548 0.414350 -0.322011 -0.118503 -0.116324 0.089940 0.098207 0.075351 0.070771 0.161784 0.160648 0.081917 0.081723 0.092831 0.189142 0.146056 0.102061 0.114130 0.138669 0.113037 0.131756 0.114002 0.209996
qa: -0.0172 0.8656 -0.4965 -0.4788 -0.4515 -0.2901 -0.2917 0.2268 -0.3106 -0.3147 -0.2096 -0.1440 -0.4315 -0.4250 -0.1959 0.1409 -0.1216 0.2112 -0.0918 -0.1127 -0.1518 0.1715 -0.2774 0.3768 0.3717 0.4185 0.4144 -0.3220 -0.1185 -0.1163 0.0899 0.0982 0.0754 0.0708 0.1618 0.1606 0.0819 0.0817 0.0928 0.1891 0.1461 0.1021 0.1141 0.1387 0.1130 0.1318 0.1140 0.2100
va: 1.3033 5.9003 1.9862 2.0255 2.0730 2.1400 2.1309 3.4242 2.8693 3.1287 3.0727 3.1773 2.9708 2.9666 3.8480 3.9450 3.8783 3.9956 3.8594 3.9022 4.0556 4.2035 3.9442 4.4007 4.2464 3.9932 4.0263 3.9288 3.8501 3.8494 1.0151 1.0048 1.0090 1.0104 0.9887 1.0016 1.0012 1.0011 1.0037 1.0190 1.0159 0.9911 0.9966 0.9961 0.9957 0.9933 0.9956 1.0666
dispcorr: -0.025651640 hartree
energy: -2238.528619111978
dipole: 40.30679 -36.45657 3.85021 21.56515 -18.30096 3.26419 -16.82602 15.61860 -1.20742
magnitude: 5.19008 au
magnitude: 13.19214 debye
