program: Orca
programVersion: 4.2.1
elementType: Cl S O O O O O N N N N N N N C C C C C C C C C C C C C C C C H H H H H H H H H H H H H H H H H H
charge: 0
multiplicity: 1
keywords: wb97x-d3
keywords: def2-TZVPP
keywords: def2/J RIJCOSX GRIDX6 NOFINALGRIDX
keywords: grid4 nofinalgrid
keywords: scfconv7
keywords: smallprint printgap noloewdin
keywords: NOSOSCF
formula: C16H18ClN7O5S
InChI: InChI=1S/C16H18ClN7O5S/c1-4-5-9-6-7-10-18-13(17)14(24(10)22-9)30(26,27)23-16(25)21-15-19-11(28-2)8-12(20-15)29-3/h6-8,21,23H,4-5H2,1-3H3
48 atoms
Cl -4.808461 -1.285894 -1.069595
S  -1.876383 -0.97379 0.97597
O  -2.659966 -2.184336 0.967566
O  -1.572477 -0.306804 2.223692
O  -1.150451 -2.110144 -1.657162
O  3.366252 -0.353269 2.320283
O  5.622567 -2.379768 -1.197345
N  -2.1470 1.383517 -0.363422
N  -1.046539 1.902599 0.162851
N  -3.975384 1.156888 -1.604417
N  -0.389799 -1.229309 0.292898
N  1.082051 -2.023595 -1.31398
N  2.212301 -1.167463 0.527593
N  3.349666 -2.195589 -1.262111
C  -2.640737 0.129842 -0.114308
C  -0.754946 3.115125 -0.216563
C  0.457237 3.745482 0.389273
C  -2.985094 1.972843 -1.267748
C  0.088114 4.784529 1.450539
C  -1.556215 3.844715 -1.140434
C  -2.671058 3.280139 -1.673363
C  -3.763005 0.039257 -0.916793
C  1.317121 5.449902 2.047419
C  -0.224749 -1.81164 -0.93679
C  2.260798 -1.779794 -0.643615
C  3.369368 -0.960725 1.148134
C  4.497119 -1.982966 -0.633516
C  4.579873 -1.357662 0.606402
C  2.121304 0.050463 2.883917
C  5.566229 -3.026806 -2.465982
H  1.082569 2.967593 0.830881
H  1.045625 4.221218 -0.399976
H  -0.49313 4.300018 2.239425
H  -0.562501 5.546436 1.011799
H  -1.260224 4.84706 -1.417524
H  -3.303968 3.789543 -2.385856
H  1.973868 4.720792 2.525833
H  1.89978 5.969186 1.284023
H  1.036893 6.184376 2.803402
H  1.187961 -2.46803 -2.216745
H  5.521276 -1.193901 1.110836
H  1.4649 -0.801147 3.06865
H  1.609635 0.781409 2.255389
H  2.365838 0.5168 3.834634
H  4.990258 -3.951784 -2.42311
H  6.596758 -3.259379 -2.721998
H  5.144063 -2.376572 -3.232862
H  0.455191 -0.957686 0.815736
elementType: Cl S O N C H
totalener: -2238.50304184 hartree
nucrepener: 3479.41082428 hartree
electener: -5717.91386612 hartree
oneelecener: -9990.74464284 hartree
twoeener: 4272.83077672 hartree
cpcmener: -0.04428835 hartree
kineticenergy: 2231.43474692 hartree
xcener: -168.720868819035 hartree
chargesum: 0.0000000
charge: -0.017200 0.866657 -0.477200 -0.496698 -0.449650 -0.290210 -0.291204 0.226372 -0.316890 -0.315526 -0.209102 -0.142797 -0.430417 -0.425265 -0.202345 0.138686 -0.122506 0.210123 -0.092793 -0.107568 -0.151085 0.176116 -0.279551 0.373105 0.371319 0.421290 0.416146 -0.325624 -0.114390 -0.116483 0.091205 0.100119 0.077865 0.072906 0.161231 0.160983 0.081560 0.081907 0.093896 0.189558 0.145651 0.117911 0.090210 0.139965 0.113540 0.131852 0.113587 0.210744
qa: -0.0172 0.8667 -0.4772 -0.4967 -0.4497 -0.2902 -0.2912 0.2264 -0.3169 -0.3155 -0.2091 -0.1428 -0.4304 -0.4253 -0.2023 0.1387 -0.1225 0.2101 -0.0928 -0.1076 -0.1511 0.1761 -0.2796 0.3731 0.3713 0.4213 0.4161 -0.3256 -0.1144 -0.1165 0.0912 0.1001 0.0779 0.0729 0.1612 0.1610 0.0816 0.0819 0.0939 0.1896 0.1457 0.1179 0.0902 0.1400 0.1135 0.1319 0.1136 0.2107
va: 1.3032 5.9010 2.0276 1.9864 2.0739 2.1413 2.1315 3.4192 2.8665 3.1292 3.0689 3.1779 2.9732 2.9664 3.8479 3.9499 3.8899 3.9984 3.8558 3.9050 4.0541 4.2002 3.9464 4.4028 4.2506 3.9887 4.0238 3.9310 3.8545 3.8491 1.0048 1.0063 1.0096 1.0097 0.9891 1.0012 1.0010 1.0008 1.0031 1.0185 1.0161 0.9977 0.9854 0.9958 0.9958 0.9932 0.9956 1.0678
dispcorr: -0.026023350 hartree
energy: -2238.529065186782
dipole: 36.73701 -32.73073 4.00628 29.01042 -25.65339 3.35703 8.82718 -9.72196 -0.89478
magnitude: 5.30288 au
magnitude: 13.47886 debye
