program: Orca
programVersion: 4.2.1
elementType: Cl S O O O O O N N N N N N N C C C C C C C C C C C C C C C C H H H H H H H H H H H H H H H H H H
charge: 0
multiplicity: 1
keywords: wb97x-d3
keywords: def2-TZVPP
keywords: def2/J RIJCOSX GRIDX6 NOFINALGRIDX
keywords: grid4 nofinalgrid
keywords: scfconv7
keywords: smallprint printgap noloewdin
keywords: NOSOSCF
formula: C16H18ClN7O5S
InChI: InChI=1S/C16H18ClN7O5S/c1-4-5-9-6-7-10-18-13(17)14(24(10)22-9)30(26,27)23-16(25)21-15-19-11(28-2)8-12(20-15)29-3/h6-8,21,23H,4-5H2,1-3H3
48 atoms
Cl -4.783052 -0.607845 1.50337
S  -1.828142 -1.330123 -0.39169
O  -1.504073 -1.37526 -1.801514
O  -2.615859 -2.374174 0.215937
O  -1.13195 -0.930465 2.457657
O  3.431483 -1.699787 -1.772123
O  5.635269 -1.473381 2.308015
N  -2.11113 1.38339 -0.396074
N  -1.001478 1.584279 -1.093547
N  -3.950513 1.785038 0.783086
N  -0.34893 -1.213983 0.345602
N  1.10443 -1.024486 2.143741
N  2.257615 -1.340112 0.151106
N  3.367451 -1.234982 2.228047
C  -2.604375 0.165822 -0.006399
C  -0.70758 2.829504 -1.342911
C  0.525619 3.093222 -2.144919
C  -2.956651 2.335869 0.098866
C  0.203114 3.546759 -3.570521
C  -1.518389 3.913938 -0.90108
C  -2.642918 3.676447 -0.177194
C  -3.733938 0.474937 0.72919
C  1.462401 3.85229 -4.364785
C  -0.197757 -1.055919 1.698365
C  2.290022 -1.207807 1.466303
C  3.418564 -1.546558 -0.461339
C  4.519677 -1.432436 1.603969
C  4.617622 -1.607144 0.227702
C  2.196909 -1.669853 -2.483088
C  5.566643 -1.29233 3.719586
H  1.11491 3.865066 -1.642292
H  1.135264 2.188305 -2.171312
H  -0.434108 4.435048 -3.542072
H  -0.375357 2.767784 -4.073324
H  -1.220227 4.925675 -1.138583
H  -3.283118 4.465711 0.190156
H  1.219999 4.163693 -5.381439
H  2.038453 4.656281 -3.902855
H  2.111987 2.977957 -4.434288
H  1.197653 -0.911713 3.14485
H  5.561749 -1.778476 -0.268063
H  1.521824 -2.461135 -2.155741
H  2.453212 -1.838945 -3.525331
H  1.702615 -0.701049 -2.396881
H  4.959592 -2.061191 4.197216
H  5.172797 -0.310292 3.981099
H  6.5906 -1.372884 4.075048
H  0.501717 -1.248732 -0.235454
elementType: Cl S O N C H
totalener: -2238.50303510 hartree
nucrepener: 3474.24468158 hartree
electener: -5712.74771668 hartree
oneelecener: -9980.47418004 hartree
twoeener: 4267.72646336 hartree
cpcmener: -0.04416864 hartree
kineticenergy: 2231.44388699 hartree
xcener: -168.722441048016 hartree
chargesum: 0.0000000
charge: -0.016886 0.866137 -0.496506 -0.477891 -0.449781 -0.289707 -0.291642 0.226684 -0.317004 -0.314571 -0.210629 -0.143017 -0.431310 -0.425561 -0.199125 0.138958 -0.117218 0.211334 -0.091866 -0.106638 -0.153625 0.174355 -0.279262 0.373686 0.371580 0.419350 0.414539 -0.322184 -0.116721 -0.116190 0.098463 0.088280 0.071326 0.077359 0.160344 0.160989 0.093162 0.082036 0.081815 0.188986 0.145938 0.113545 0.139433 0.099166 0.113775 0.112949 0.131705 0.211437
qa: -0.0169 0.8661 -0.4965 -0.4779 -0.4498 -0.2897 -0.2916 0.2267 -0.3170 -0.3146 -0.2106 -0.1430 -0.4313 -0.4256 -0.1991 0.1390 -0.1172 0.2113 -0.0919 -0.1066 -0.1536 0.1744 -0.2793 0.3737 0.3716 0.4194 0.4145 -0.3222 -0.1167 -0.1162 0.0985 0.0883 0.0713 0.0774 0.1603 0.1610 0.0932 0.0820 0.0818 0.1890 0.1459 0.1135 0.1394 0.0992 0.1138 0.1129 0.1317 0.2114
va: 1.3036 5.9003 1.9868 2.0265 2.0738 2.1414 2.1308 3.4183 2.8633 3.1293 3.0703 3.1771 2.9703 2.9665 3.8477 3.9462 3.8860 3.9978 3.8590 3.9041 4.0565 4.2026 3.9449 4.4013 4.2497 3.9920 4.0261 3.9298 3.8550 3.8497 1.0052 1.0108 1.0103 1.0094 0.9889 1.0015 1.0034 1.0007 1.0011 1.0191 1.0159 0.9970 0.9957 0.9871 0.9956 0.9959 0.9933 1.0670
dispcorr: -0.025752339 hartree
energy: -2238.528787438126
dipole: 37.17340 -33.17104 4.00236 21.14254 -17.79205 3.35049 -21.11857 20.29911 -0.81945
magnitude: 5.28358 au
magnitude: 13.42979 debye
