program: Orca
programVersion: 4.2.1
elementType: Cl S O O O O O N N N N N N N C C C C C C C C C C C C C C C C H H H H H H H H H H H H H H H H H H
charge: 0
multiplicity: 1
keywords: wb97x-d3
keywords: def2-TZVPP
keywords: def2/J RIJCOSX GRIDX6 NOFINALGRIDX
keywords: grid4 nofinalgrid
keywords: scfconv7
keywords: smallprint printgap noloewdin
keywords: NOSOSCF
formula: C16H18ClN7O5S
InChI: InChI=1S/C16H18ClN7O5S/c1-4-5-9-6-7-10-18-13(17)14(24(10)22-9)30(26,27)23-16(25)21-15-19-11(28-2)8-12(20-15)29-3/h6-8,21,23H,4-5H2,1-3H3
48 atoms
Cl -1.733836 -1.428205 1.469347
S  -0.665883 -0.321436 -1.614153
O  -0.359156 0.556711 -2.713529
O  -1.251577 -1.623648 -1.850853
O  1.180408 1.485605 -0.204825
O  1.843553 -4.718204 0.395824
O  4.933994 -2.918129 3.354038
N  -2.058605 1.834627 -0.513255
N  -1.929725 2.662941 -1.538417
N  -2.654535 1.055738 1.489015
N  0.703048 -0.666095 -0.738738
N  2.377241 -0.158333 0.784241
N  2.089043 -2.454865 0.567637
N  3.657987 -1.533142 2.065842
C  -1.635946 0.53104 -0.450886
C  -2.423301 3.857735 -1.376424
C  -2.343372 4.783383 -2.547867
C  -2.671263 2.108796 0.680285
C  -3.690368 4.891904 -3.267088
C  -3.065077 4.271192 -0.175329
C  -3.195215 3.399267 0.857182
C  -2.029648 0.108905 0.804582
C  -3.625724 5.821863 -4.467323
C  1.40444 0.302703 -0.070815
C  2.715374 -1.444986 1.147259
C  2.443184 -3.679267 0.945296
C  4.002198 -2.759229 2.433584
C  3.422131 -3.903768 1.897608
C  0.822057 -4.49464 -0.572716
C  5.528343 -1.76348 3.941128
H  -2.029107 5.772902 -2.205638
H  -1.58155 4.420907 -3.239964
H  -4.45383 5.246473 -2.568959
H  -4.004949 3.895478 -3.587943
H  -3.443704 5.280978 -0.097918
H  -3.674903 3.659391 1.789863
H  -2.899429 5.472522 -5.203495
H  -4.593754 5.885525 -4.965655
H  -3.339107 6.833842 -4.174904
H  2.889451 0.570235 1.264248
H  3.70987 -4.897975 2.207218
H  0.487448 -5.481352 -0.881262
H  1.201321 -3.963523 -1.44646
H  -0.026016 -3.955371 -0.148402
H  6.047538 -1.154641 3.200887
H  6.248686 -2.140119 4.662491
H  4.791408 -1.149014 4.458583
H  0.922612 -1.649653 -0.520886
elementType: Cl S O N C H
totalener: -2238.49994075 hartree
nucrepener: 3449.20002975 hartree
electener: -5687.69997051 hartree
oneelecener: -9931.22843626 hartree
twoeener: 4243.52846575 hartree
cpcmener: -0.04171539 hartree
kineticenergy: 2231.44077866 hartree
xcener: -168.721160629166 hartree
chargesum: -0.0000000
charge: -0.031359 0.853454 -0.459944 -0.494440 -0.450529 -0.288668 -0.290788 0.215952 -0.285968 -0.317122 -0.221377 -0.133662 -0.422792 -0.424442 -0.156368 0.130533 -0.107258 0.218313 -0.093965 -0.102786 -0.158573 0.138393 -0.279178 0.352100 0.367792 0.416391 0.412173 -0.319740 -0.118906 -0.115615 0.091878 0.087671 0.070790 0.076505 0.161332 0.160885 0.083009 0.092605 0.080410 0.190900 0.145326 0.138493 0.117209 0.101502 0.113280 0.131383 0.113685 0.211517
qa: -0.0314 0.8535 -0.4599 -0.4944 -0.4505 -0.2887 -0.2908 0.2160 -0.2860 -0.3171 -0.2214 -0.1337 -0.4228 -0.4244 -0.1564 0.1305 -0.1073 0.2183 -0.0940 -0.1028 -0.1586 0.1384 -0.2792 0.3521 0.3678 0.4164 0.4122 -0.3197 -0.1189 -0.1156 0.0919 0.0877 0.0708 0.0765 0.1613 0.1609 0.0830 0.0926 0.0804 0.1909 0.1453 0.1385 0.1172 0.1015 0.1133 0.1314 0.1137 0.2115
va: 1.2951 5.9240 2.0388 1.9925 2.0616 2.1423 2.1323 3.4648 2.8940 3.1334 3.0579 3.1785 2.9746 2.9690 3.8039 3.9604 3.8640 3.9799 3.8559 3.9004 4.0504 4.2167 3.9458 4.4180 4.2483 3.9991 4.0287 3.9285 3.8474 3.8493 1.0052 1.0239 1.0094 1.0100 0.9880 1.0016 1.0012 1.0033 1.0010 1.0179 1.0161 0.9967 0.9903 0.9973 0.9956 0.9935 0.9956 1.0730
dispcorr: -0.026052071 hartree
energy: -2238.525992825183
dipole: -0.83759 1.28618 0.44859 23.02554 -21.62941 1.39613 -12.66041 14.35764 1.69723
magnitude: 2.24299 au
magnitude: 5.70123 debye
