program: Orca
programVersion: 4.2.1
elementType: Cl S O O O O O N N N N N N N C C C C C C C C C C C C C C C C H H H H H H H H H H H H H H H H H H
charge: 0
multiplicity: 1
keywords: wb97x-d3
keywords: def2-TZVPP
keywords: def2/J RIJCOSX GRIDX6 NOFINALGRIDX
keywords: grid4 nofinalgrid
keywords: scfconv7
keywords: smallprint printgap noloewdin
keywords: NOSOSCF
formula: C16H18ClN7O5S
InChI: InChI=1S/C16H18ClN7O5S/c1-4-5-9-6-7-10-18-13(17)14(24(10)22-9)30(26,27)23-16(25)21-15-19-11(28-2)8-12(20-15)29-3/h6-8,21,23H,4-5H2,1-3H3
48 atoms
Cl 0.251666 -0.370447 -2.61009
S  -1.557471 -0.80256 0.291579
O  -1.868985 -1.958719 -0.520417
O  -2.329438 -0.500216 1.468572
O  0.3496 1.037883 1.574053
O  2.366984 -4.444256 -0.691819
O  6.233051 -2.205672 0.567174
N  -2.067637 1.828015 -0.496981
N  -2.910293 2.138086 0.476016
N  -0.814826 2.038069 -2.329159
N  0.04402 -1.024126 0.679853
N  2.16328 -0.273184 1.251609
N  2.23913 -2.377477 0.268958
N  4.197137 -1.236267 0.916462
C  -1.492031 0.605187 -0.72872
C  -3.343484 3.366826 0.491017
C  -4.347603 3.712412 1.543379
C  -1.631207 2.664393 -1.490389
C  -5.763131 3.779566 0.963582
C  -2.943815 4.337502 -0.469704
C  -2.090891 3.990517 -1.46754
C  -0.73359 0.798879 -1.867041
C  -6.800822 4.113222 2.02225
C  0.812626 -0.018687 1.202572
C  2.889048 -1.350197 0.788892
C  2.973156 -3.397219 -0.165492
C  4.917597 -2.258648 0.477705
C  4.354773 -3.399397 -0.084434
C  0.945927 -4.437366 -0.801173
C  6.841627 -1.040379 1.1161
H  -4.306801 2.963573 2.336078
H  -4.086945 4.675517 1.990109
H  -6.004776 2.820005 0.49906
H  -5.800384 4.526503 0.165597
H  -3.328181 5.345359 -0.395748
H  -1.758858 4.685037 -2.225905
H  -7.801074 4.156821 1.589441
H  -6.818225 3.362048 2.814041
H  -6.601613 5.08032 2.48788
H  2.716653 0.479915 1.639114
H  4.953738 -4.226108 -0.437535
H  0.463761 -4.357745 0.173791
H  0.680246 -5.392665 -1.24581
H  0.59623 -3.638361 -1.456199
H  6.540295 -0.875229 2.150559
H  6.612896 -0.150794 0.528764
H  7.912146 -1.225425 1.080884
H  0.531385 -1.86426 0.332458
elementType: Cl S O N C H
totalener: -2238.49961001 hartree
nucrepener: 3450.20837789 hartree
electener: -5688.70798790 hartree
oneelecener: -9933.24863053 hartree
twoeener: 4244.54064264 hartree
cpcmener: -0.04164772 hartree
kineticenergy: 2231.44077421 hartree
xcener: -168.721020075536 hartree
chargesum: -0.0000000
charge: -0.031288 0.854683 -0.493324 -0.459857 -0.451184 -0.288475 -0.290933 0.216616 -0.287039 -0.317167 -0.222367 -0.134453 -0.423353 -0.424356 -0.158627 0.128061 -0.104234 0.218265 -0.093792 -0.101909 -0.157915 0.140239 -0.280501 0.351485 0.367906 0.417372 0.415853 -0.323517 -0.117393 -0.115745 0.086965 0.092129 0.076568 0.070950 0.161301 0.159865 0.092705 0.083540 0.080370 0.190981 0.145557 0.115899 0.138044 0.102537 0.113493 0.113025 0.131646 0.211374
qa: -0.0313 0.8547 -0.4933 -0.4599 -0.4512 -0.2885 -0.2909 0.2166 -0.2870 -0.3172 -0.2224 -0.1345 -0.4234 -0.4244 -0.1586 0.1281 -0.1042 0.2183 -0.0938 -0.1019 -0.1579 0.1402 -0.2805 0.3515 0.3679 0.4174 0.4159 -0.3235 -0.1174 -0.1157 0.0870 0.0921 0.0766 0.0710 0.1613 0.1599 0.0927 0.0835 0.0804 0.1910 0.1456 0.1159 0.1380 0.1025 0.1135 0.1130 0.1316 0.2114
va: 1.2958 5.9211 1.9933 2.0386 2.0606 2.1422 2.1320 3.4628 2.8939 3.1342 3.0584 3.1782 2.9730 2.9700 3.8054 3.9660 3.8635 3.9799 3.8561 3.8993 4.0510 4.2142 3.9463 4.4191 4.2489 3.9967 4.0252 3.9299 3.8469 3.8493 1.0239 1.0053 1.0098 1.0094 0.9881 1.0019 1.0030 1.0010 1.0011 1.0179 1.0163 0.9905 0.9965 0.9978 0.9955 0.9958 0.9935 1.0741
dispcorr: -0.026088463 hartree
energy: -2238.525698473596
dipole: -14.55297 15.79902 1.24605 15.70707 -13.88297 1.82410 14.94021 -15.02856 -0.08835
magnitude: 2.21084 au
magnitude: 5.61950 debye
