program: Orca
programVersion: 4.2.1
elementType: Cl S O O O O O N N N N N N N C C C C C C C C C C C C C C C C H H H H H H H H H H H H H H H H H H
charge: 0
multiplicity: 1
keywords: wb97x-d3
keywords: def2-TZVPP
keywords: def2/J RIJCOSX GRIDX6 NOFINALGRIDX
keywords: grid4 nofinalgrid
keywords: scfconv7
keywords: smallprint printgap noloewdin
keywords: NOSOSCF
formula: C16H18ClN7O5S
InChI: InChI=1S/C16H18ClN7O5S/c1-4-5-9-6-7-10-18-13(17)14(24(10)22-9)30(26,27)23-16(25)21-15-19-11(28-2)8-12(20-15)29-3/h6-8,21,23H,4-5H2,1-3H3
48 atoms
Cl -2.090414 -1.911896 0.433257
S  -0.405883 0.792331 1.738291
O  -0.772601 -0.050526 2.855933
O  0.049587 2.140735 1.956403
O  0.840207 1.231243 -0.888103
O  4.140914 -4.626047 -1.840835
O  2.055849 -4.048693 2.265966
N  -2.232292 1.883309 -0.072807
N  -1.925406 3.156547 0.118594
N  -3.238719 0.071159 -0.895226
N  0.750129 -0.099784 0.945384
N  1.974743 -0.724612 -0.923552
N  3.061805 -2.668847 -1.381735
N  2.00382 -2.382954 0.705301
C  -1.711435 0.80206 0.591039
C  -2.558227 4.018231 -0.626446
C  -2.189663 5.456757 -0.451432
C  -3.154594 1.394869 -0.960136
C  -1.163867 5.908284 -1.494039
C  -3.529424 3.635746 -1.593148
C  -3.837201 2.323706 -1.760863
C  -2.366316 -0.281592 0.037535
C  -0.812325 7.379241 -1.345141
C  1.169979 0.212919 -0.320323
C  2.359476 -1.979981 -0.502721
C  3.440977 -3.881952 -1.005384
C  2.390664 -3.601271 1.070677
C  3.134015 -4.421119 0.239096
C  4.446639 -4.10953 -3.133241
C  1.27386 -3.21939 3.121354
H  -3.090482 6.070346 -0.532763
H  -1.784375 5.605081 0.551009
H  -1.552117 5.722984 -2.499585
H  -0.262517 5.298136 -1.393819
H  -4.022214 4.399228 -2.178855
H  -4.572316 1.978277 -2.473698
H  -0.065681 7.68122 -2.080619
H  -1.688498 8.01508 -1.485652
H  -0.403978 7.593248 -0.35564
H  2.274911 -0.47726 -1.857481
H  3.448005 -5.411568 0.534595
H  5.008626 -4.892517 -3.635738
H  5.059152 -3.209751 -3.074946
H  3.544087 -3.893193 -3.705124
H  1.126456 -3.793166 4.032427
H  0.298064 -2.997276 2.687175
H  1.7913 -2.292173 3.370512
H  1.028121 -1.014069 1.33104
elementType: Cl S O N C H
totalener: -2238.49980558 hartree
nucrepener: 3459.10337287 hartree
electener: -5697.60317845 hartree
oneelecener: -9951.05499353 hartree
twoeener: 4253.45181508 hartree
cpcmener: -0.04109669 hartree
kineticenergy: 2231.43720272 hartree
xcener: -168.720088670891 hartree
chargesum: -0.0000000
charge: -0.030904 0.852977 -0.493044 -0.460685 -0.450945 -0.291226 -0.288413 0.216013 -0.283274 -0.318087 -0.221068 -0.137162 -0.424590 -0.425310 -0.157584 0.126918 -0.111620 0.219345 -0.089071 -0.093421 -0.159821 0.136995 -0.281474 0.357033 0.369106 0.415999 0.418723 -0.324617 -0.116162 -0.116251 0.089000 0.089375 0.070904 0.075048 0.160610 0.159415 0.092738 0.081202 0.082381 0.190886 0.145285 0.131584 0.113249 0.113780 0.138443 0.100282 0.116022 0.211414
qa: -0.0309 0.8530 -0.4930 -0.4607 -0.4509 -0.2912 -0.2884 0.2160 -0.2833 -0.3181 -0.2211 -0.1372 -0.4246 -0.4253 -0.1576 0.1269 -0.1116 0.2193 -0.0891 -0.0934 -0.1598 0.1370 -0.2815 0.3570 0.3691 0.4160 0.4187 -0.3246 -0.1162 -0.1163 0.0890 0.0894 0.0709 0.0750 0.1606 0.1594 0.0927 0.0812 0.0824 0.1909 0.1453 0.1316 0.1132 0.1138 0.1384 0.1003 0.1160 0.2114
va: 1.2955 5.9260 1.9950 2.0383 2.0602 2.1316 2.1421 3.4697 2.9014 3.1341 3.0598 3.1788 2.9687 2.9733 3.8018 3.9662 3.8711 3.9755 3.8532 3.8968 4.0522 4.2205 3.9456 4.4121 4.2481 4.0229 3.9952 3.9297 3.8493 3.8483 1.0053 1.0220 1.0094 1.0130 0.9880 1.0018 1.0032 1.0006 1.0014 1.0180 1.0163 0.9935 0.9956 0.9958 0.9965 0.9975 0.9909 1.0721
dispcorr: -0.026054962 hartree
energy: -2238.525860544085
dipole: 9.07219 -8.97715 0.09504 25.28081 -25.26127 0.01954 -12.86395 10.44270 -2.42126
magnitude: 2.42320 au
magnitude: 6.15928 debye
