program: Gaussian 09
title: 000069051
version: EM64L-G09RevD.01
frameworkgroup: C1[X(C9H11NO2)]
method: RPBEPBE
basis: SDD
operation: Freq
keyword: #p
keyword: freq=noraman
keyword: PBEPBE/SDD
title: #p freq=noraman PBEPBE/SDD
converged: NO YES NO NO
title: Mulliken charges:
elementType: O O N C C C C C C C C C H H H H H H H H H H H
charge: -0.213326 -0.213340 0.024906 0.399031 0.399685 0.040439 0.492041 -0.592419 -0.594506 -0.783785 -0.783879 -0.806959 0.244858 0.244870 0.253974 0.253961 0.210320 0.210442 0.253832 0.254079 0.230998 0.231107 0.243671
chargesum: 0.00000
title: Mulliken charges with hydrogens summed into heavy atoms:
elementType: O O N C C C C C C C C C
charge: -0.213326 -0.213340 0.024906 0.399031 0.399685 0.040439 0.492041 -0.347562 -0.349636 -0.065530 -0.065525 -0.101183
polarizability: 1.57624769e+02 3.66612542e-02 1.36429851e+02 -5.55374521e-01 1.54623317e-02 5.84109348e+01
1716.lowfreq: -71.4579 -13.1452 -8.5015 -0.0010 -0.0007 -0.0007 6.3598 12.8282 67.5707
frequency: -71.4226 10.1782 67.5436 171.0354 202.4778 240.7888 271.3942 277.3440 299.5464 318.3553 339.7414 361.0038 391.0673 522.7076 526.7146 537.8697 554.5956 580.9589 594.6895 671.7922 735.2039 773.6305 867.5837 896.8408 941.6913 968.7963 1020.9644 1024.4329 1038.4330 1041.3477 1047.9010 1055.5406 1062.9972 1194.2315 1201.1351 1257.4598 1309.0903 1347.0295 1358.7577 1397.6837 1401.4783 1402.7574 1416.9744 1427.8979 1453.4440 1453.7014 1472.5462 1473.0219 1476.5106 1479.9431 1581.8441 1612.0027 2979.5332 2996.5010 2997.0827 3061.9741 3083.7844 3084.1355 3093.2358 3095.5791 3096.7218 3127.8805 3131.3816
redmass: 7.6961 1.0158 3.8851 2.9638 2.9101 3.9637 1.0394 1.0745 4.8336 3.7070 7.8579 2.8230 5.6934 4.6706 3.0682 3.5440 4.6208 3.6679 5.3953 3.9932 5.5288 9.7867 1.2871 1.2962 2.5395 3.4576 1.6727 1.6668 1.5491 1.5528 1.7232 1.5914 6.4086 7.2450 1.5772 1.6725 6.6926 4.1919 5.0023 1.2338 1.2868 1.4785 1.9823 1.9832 1.0470 1.0466 1.0619 1.1282 1.2573 1.2404 7.1476 5.4338 1.0392 1.0364 1.0364 1.0941 1.0958 1.0958 1.1003 1.1016 1.1015 1.0913 1.0923
irintensity: 0.0006 0.4310 1.7438 4.5982 0.0043 0.5737 1.1067 0.0543 0.2717 2.6738 0.9306 0.7432 0.4561 0.0160 0.0029 0.1162 0.4756 0.3921 2.1466 12.5258 0.0420 24.1340 17.4317 0.0005 0.4370 1.6318 0.8877 5.1747 8.4673 0.0039 33.1322 0.9654 2.2798 249.3473 49.1311 8.1301 1.0750 116.5388 35.3787 18.3232 33.5728 33.1345 2.2719 0.4804 0.4156 23.4585 12.9011 0.7372 46.1860 13.9791 40.0079 88.0442 18.5983 32.1880 0.4493 18.3798 0.6932 13.9417 12.4062 32.9746 17.9211 24.1388 11.9172
temp: 298.150 k
press: 1.00000 atm
elementType: 8 8 7 6 6 6 6 6 6 6 6 6 1 1 1 1 1 1 1 1 1 1 1
symmnumber: 1
zpe: 477791.4 jmol-1
zpe.correction: 0.181981 hartree
zpe.thermalcorrener: 0.192979 hartree
zpe.thermalcorrenthalpy: 0.193923 hartree
zpe.thermalcorrgfe: 0.143928 hartree
zpe.sumelectzpe: -553.791104 hartree
zpe.sumelectthermal: -553.780107 hartree
zpe.sumelectthermalent: -553.779163 hartree
zpe.sumelectthermalfe: -553.829158 hartree
dipole: -5.5139 -0.0008 0.0571
dipole: 5.5142
quadrupole: -77.4492 -65.0282 -71.6633
quadrupole: 0.0031 -0.3383 -0.0113
quadrupole: -6.0690 6.3520 -0.2831 0.0031 -0.3383 -0.0113
hfenergy: -553.9730854 hartree
pointgroup: C01 [X(C9H11N1O2)]
dipole: -2.1693933 -0.0008197 -0.0145705 debye
dipolederiv: -0.7190267 -0.2303013 0.0017176 -0.2631984 -0.7265378 -0.0008499 0.0041574 0.0018019 -0.221604 -0.7199987 0.230991 0.0027023 0.2634254 -0.7259255 -0.0011708 0.0048291 -0.0041338 -0.221778 1.7621063 -0.0002364 -0.0069633 0.0000617 1.1866903 0.0025006 -0.0115767 0.0024275 0.1744712 0.3513585 0.2886599 0.0008762 -0.1757704 0.2482578 0.0044759 -0.0097472 0.0002425 0.04249 0.3520371 -0.288576 0.0009524 0.1760954 0.2487563 -0.0045822 -0.0088517 -0.0001837 0.042616 -0.8190839 -0.0001224 -0.0021336 -0.0008342 -0.14473 -0.0002867 0.0049336 -0.0001493 -0.0282913 0.6408604 -0.0004153 0.024305 -0.0014893 0.2900029 0.0000331 0.0920121 0.0000421 0.0320774 -0.4298845 -0.3470601 0.0003678 -0.2727281 -0.1284027 -0.0067846 -0.006525 -0.0020615 -0.1990156 -0.4306149 0.3468195 0.0001869 0.272926 -0.1284371 0.0067056 -0.006591 0.0017997 -0.1986893 0.0424953 -0.2687503 0.0002143 -0.1066804 -0.100779 0.0003362 0.0031161 0.0005581 0.0188801 0.0421509 0.268054 0.0000422 0.1064761 -0.1011265 -0.0005548 0.00327 -0.0007604 0.0189214 -0.2493094 0.000504 -0.022734 0.0042647 0.0696905 -0.0000524 -0.1756228 0.0000152 0.0453137 0.0299003 0.0699001 0.0032519 0.0952163 -0.0623261 0.0004636 0.0069264 -0.0031347 0.1418619 0.0297285 -0.0700403 0.0032986 -0.0951718 -0.0623853 -0.0003988 0.006894 0.00328 0.1419246 0.0410849 -0.017352 -0.088348 0.0003339 0.0610524 0.0043131 -0.0790367 -0.0259833 -0.0089355 0.0429701 -0.0170916 0.0875381 -0.0010319 0.0616802 -0.0035851 0.0777528 0.0261305 -0.0111003 -0.0462869 0.2056815 0.0013762 0.0682467 -0.0526964 -0.0006846 0.0009586 -0.001912 0.0999081 -0.0460954 -0.2053305 0.0016525 -0.0681142 -0.0522292 0.0009102 0.0010828 0.0023077 0.0999764 0.0407863 0.0171671 -0.0885782 -0.0003477 0.0608898 -0.0043289 -0.079314 0.026036 -0.0089368 0.04338 0.0173491 0.0874967 0.0012382 0.0616777 0.0034636 0.0776391 -0.0263468 -0.011128 0.0277068 -0.0211944 0.0195373 -0.0914674 -0.0594523 0.0937983 0.084728 0.0751516 0.0687906 0.026926 0.0210755 0.0202663 0.0886112 -0.0561487 -0.0960131 0.086647 -0.0770254 0.065944 -0.0131912 0.0002688 -0.047025 -0.0000618 0.1124787 0.0022918 -0.0776818 0.0018982 -0.0836969 unknown
polarizability: 157.6275317|-0.0255926|136.4298124|0.1937278|0.0271179|58.4082106 unknown
InChI: InChI=1S/C9H11NO2/c1-6-4-7(2)9(10(11)12)8(3)5-6/h4-5H,1-3H3
charge 0 multiplicity 1
23 atoms
O  2.745869 1.131356 -0.016915
O  2.748131 -1.127932 -0.021693
N  2.112912 0.00106 -0.012411
C  -0.072503 1.255407 0.004701
C  -0.072158 -1.255668 0.004762
C  0.627378 -0.000012 -0.001634
C  -2.215367 -0.000323 0.017078
C  -1.486226 1.209788 0.015952
C  -1.485987 -1.210209 0.01616
C  0.563157 2.634752 0.003509
C  0.563068 -2.635216 0.003926
C  -3.730579 -0.000313 -0.004211
H  -2.032318 2.160414 0.024719
H  -2.031898 -2.160923 0.025164
H  1.221129 2.786741 0.875753
H  1.209663 2.790125 -0.876664
H  -0.228191 3.403124 0.010065
H  -0.228614 -3.403244 0.01209
H  1.222037 -2.786843 0.875483
H  1.20839 -2.791575 -0.876915
H  -4.143374 -0.899852 0.483848
H  -4.143476 0.890033 0.500504
H  -4.106245 0.00961 -1.045971
