program: Orca
programVersion: 4.2.1
elementType: Cl S O O O O O N N N N N N N C C C C C C C C C C C C C C C C H H H H H H H H H H H H H H H H H H
charge: 0
multiplicity: 1
keywords: wb97x-d3
keywords: def2-TZVPP
keywords: def2/J RIJCOSX GRIDX6 NOFINALGRIDX
keywords: grid4 nofinalgrid
keywords: scfconv7
keywords: smallprint printgap noloewdin
keywords: NOSOSCF
formula: C16H18ClN7O5S
InChI: InChI=1S/C16H18ClN7O5S/c1-4-5-9-6-7-10-18-13(17)14(24(10)22-9)30(26,27)23-16(25)21-15-19-11(28-2)8-12(20-15)29-3/h6-8,21,23H,4-5H2,1-3H3
48 atoms
Cl -4.925597 -0.259542 1.267817
S  -1.88985 -1.624019 -0.076788
O  -1.524421 -1.864362 -1.453817
O  -2.822129 -2.461528 0.620837
O  -1.150051 -0.926862 2.761895
O  3.296352 -1.486241 -1.627585
O  5.556523 -0.165593 2.211954
N  -1.713044 1.09404 -0.31513
N  -0.493509 1.058316 -0.833503
N  -3.616769 1.9002 0.507814
N  -0.417031 -1.584387 0.703467
N  1.073739 -0.944556 2.366662
N  2.17764 -1.248459 0.344869
N  3.313571 -0.562048 2.294287
C  -2.450411 0.017159 0.092468
C  0.038074 2.211606 -1.125695
C  1.411158 2.197129 -1.723371
C  -2.459397 2.215673 -0.04231
C  1.417722 2.581158 -3.205767
C  -0.639153 3.445437 -0.913566
C  -1.88594 3.453867 -0.37036
C  -3.613653 0.570907 0.601034
C  0.633862 1.614563 -4.079997
C  -0.253253 -1.143326 1.991476
C  2.230869 -0.924119 1.62681
C  3.313224 -1.19036 -0.340986
C  4.440327 -0.518446 1.600315
C  4.513494 -0.82272 0.244384
C  2.071899 -1.912083 -2.216082
C  5.499071 0.148349 3.594962
H  2.048645 2.88801 -1.164888
H  1.838457 1.201524 -1.598094
H  2.456965 2.620965 -3.539189
H  1.025441 3.594881 -3.328661
H  -0.144239 4.369178 -1.180184
H  -2.43899 4.361668 -0.177001
H  0.707584 1.892346 -5.130979
H  1.012215 0.596315 -3.980249
H  -0.42474 1.592194 -3.820683
H  1.184243 -0.657883 3.327738
H  5.438916 -0.781064 -0.30894
H  1.290605 -1.154279 -2.140732
H  1.707302 -2.836865 -1.767323
H  2.298547 -2.091123 -3.263494
H  6.516814 0.399749 3.880732
H  5.152719 -0.698142 4.188232
H  4.845429 0.999085 3.789332
H  0.416132 -1.594838 0.105362
totalener: -2238.46859415 hartree
nucrepener: 3579.20264571 hartree
electener: -5817.67123986 hartree
twoeener: 4371.65022017 hartree
kineticenergy: 2231.48742889 hartree
xcener: -168.721228021132 hartree
chargesum: -0.0000000
charge: 0.007845 0.853005 -0.455908 -0.408080 -0.350371 -0.265325 -0.263134 0.186105 -0.269890 -0.261466 -0.222592 -0.166118 -0.405729 -0.402036 -0.198323 0.073046 -0.136717 0.174033 -0.104952 -0.080613 -0.152373 0.176809 -0.247533 0.320732 0.351306 0.372199 0.386184 -0.299282 -0.114413 -0.124934 0.104430 0.068124 0.077219 0.063089 0.132943 0.144630 0.094285 0.075671 0.089977 0.168321 0.129122 0.074220 0.126611 0.131920 0.124233 0.110392 0.107135 0.206204
qa: 0.0078 0.8530 -0.4559 -0.4081 -0.3504 -0.2653 -0.2631 0.1861 -0.2699 -0.2615 -0.2226 -0.1661 -0.4057 -0.4020 -0.1983 0.0730 -0.1367 0.1740 -0.1050 -0.0806 -0.1524 0.1768 -0.2475 0.3207 0.3513 0.3722 0.3862 -0.2993 -0.1144 -0.1249 0.1044 0.0681 0.0772 0.0631 0.1329 0.1446 0.0943 0.0757 0.0900 0.1683 0.1291 0.0742 0.1266 0.1319 0.1242 0.1104 0.1071 0.2062
va: 1.3276 5.9055 2.0291 2.1039 2.1617 2.1375 2.1513 3.4395 2.8834 3.1363 3.0790 3.1564 2.9470 2.9731 3.8634 3.9565 3.9383 4.0515 3.8787 3.8785 4.0824 4.1955 3.9354 4.4141 4.2564 4.0084 4.0592 3.9450 3.8584 3.8746 1.0094 1.0227 1.0109 1.0097 1.0004 1.0085 1.0052 1.0048 1.0050 1.0347 1.0222 0.9938 0.9985 0.9943 0.9939 0.9969 0.9971 1.0707
dispcorr: -0.029847439 hartree
energy: -2238.498441594085
dipole: 38.47460 -35.26515 3.20945 14.68321 -12.53322 2.14999 -19.70278 19.04304 -0.65974
magnitude: 3.91896 au
magnitude: 9.96120 debye
