program: Orca
programVersion: 4.2.1
elementType: Cl S O O O O O N N N N N N N C C C C C C C C C C C C C C C C H H H H H H H H H H H H H H H H H H
charge: 0
multiplicity: 1
keywords: wb97x-d3
keywords: def2-TZVPP
keywords: def2/J RIJCOSX GRIDX6 NOFINALGRIDX
keywords: grid4 nofinalgrid
keywords: scfconv7
keywords: smallprint printgap noloewdin
keywords: NOSOSCF
formula: C16H18ClN7O5S
InChI: InChI=1S/C16H18ClN7O5S/c1-4-5-9-6-7-10-18-13(17)14(24(10)22-9)30(26,27)23-16(25)21-15-19-11(28-2)8-12(20-15)29-3/h6-8,21,23H,4-5H2,1-3H3
48 atoms
Cl -2.346321 -1.67263 1.236757
S  -0.824522 -0.381842 -1.600935
O  -0.518484 0.50031 -2.690196
O  -1.283209 -1.733779 -1.817224
O  0.831419 1.585971 -0.070051
O  2.109971 -4.540186 0.444422
O  5.512998 -2.41428 2.783561
N  -2.341775 1.713195 -0.553074
N  -2.025297 2.615784 -1.463952
N  -3.264063 0.809472 1.267123
N  0.514918 -0.597233 -0.625064
N  2.274929 0.051204 0.74294
N  2.177361 -2.263284 0.561461
N  3.893905 -1.176768 1.761009
C  -1.937709 0.405207 -0.513324
C  -2.515759 3.80686 -1.296931
C  -2.190757 4.835654 -2.342122
C  -3.145403 1.910951 0.542941
C  -1.009358 4.504425 -3.247126
C  -3.359895 4.142687 -0.199696
C  -3.68324 3.195783 0.718954
C  -2.531951 -0.09638 0.631307
C  0.332877 4.520451 -2.529212
C  1.168372 0.430033 -0.00516
C  2.7969 -1.18957 1.024471
C  2.704056 -3.442956 0.871874
C  4.412836 -2.359654 2.054942
C  3.854884 -3.561757 1.633639
C  0.917129 -4.42167 -0.320524
C  6.094344 -1.197451 3.224775
H  -3.091557 4.980726 -2.948813
H  -2.019168 5.794073 -1.841657
H  -0.999907 5.239699 -4.055253
H  -1.163421 3.530889 -3.714486
H  -3.736765 5.15272 -0.114811
H  -4.320041 3.389551 1.56992
H  0.398643 3.741255 -1.772038
H  1.145539 4.351267 -3.235473
H  0.513124 5.4837 -2.04699
H  2.767382 0.823095 1.166505
H  4.285138 -4.518758 1.884913
H  1.089997 -3.911778 -1.269198
H  0.130731 -3.897353 0.224062
H  0.595072 -5.439673 -0.520151
H  5.417059 -0.636112 3.86893
H  6.386275 -0.561344 2.388882
H  6.977889 -1.483138 3.789162
H  0.820043 -1.555734 -0.427742
totalener: -2238.46824642 hartree
nucrepener: 3486.37458326 hartree
electener: -5724.84282968 hartree
twoeener: 4279.89156901 hartree
kineticenergy: 2231.48390927 hartree
xcener: -168.721908016781 hartree
chargesum: -0.0000000
charge: -0.030456 0.838534 -0.404087 -0.452715 -0.401141 -0.261808 -0.263158 0.189572 -0.245530 -0.269171 -0.225332 -0.161998 -0.426818 -0.407914 -0.173278 0.123659 -0.142198 0.172885 -0.063730 -0.110937 -0.145573 0.140829 -0.258426 0.357859 0.367635 0.397077 0.386083 -0.299889 -0.118032 -0.125851 0.098057 0.078631 0.065377 0.073674 0.130841 0.141309 0.106815 0.080589 0.062299 0.167056 0.130174 0.109876 0.098657 0.128387 0.108217 0.108634 0.124632 0.200687
qa: -0.0305 0.8385 -0.4041 -0.4527 -0.4011 -0.2618 -0.2632 0.1896 -0.2455 -0.2692 -0.2253 -0.1620 -0.4268 -0.4079 -0.1733 0.1237 -0.1422 0.1729 -0.0637 -0.1109 -0.1456 0.1408 -0.2584 0.3579 0.3676 0.3971 0.3861 -0.2999 -0.1180 -0.1259 0.0981 0.0786 0.0654 0.0737 0.1308 0.1413 0.1068 0.0806 0.0623 0.1671 0.1302 0.1099 0.0987 0.1284 0.1082 0.1086 0.1246 0.2007
va: 1.2911 5.9232 2.1000 2.0391 2.1071 2.1624 2.1510 3.4879 2.8905 3.1409 3.0747 3.1620 2.9752 2.9733 3.8331 3.9149 3.9351 4.0430 3.8837 3.9265 4.0593 4.1926 3.9457 4.3754 4.2378 4.0264 4.0573 3.9349 3.8689 3.8760 1.0028 1.0044 1.0031 1.0204 1.0003 1.0092 1.0037 1.0066 1.0042 1.0368 1.0214 0.9965 0.9994 0.9965 0.9968 0.9969 0.9938 1.0696
dispcorr: -0.027016318 hartree
energy: -2238.495262735412
dipole: 15.74280 -14.96977 0.77304 21.46588 -20.52110 0.94477 -7.91625 8.98440 1.06815
magnitude: 1.62207 au
magnitude: 4.12298 debye
