program: Orca
programVersion: 4.2.1
elementType: Cl S O O O O O N N N N N N N C C C C C C C C C C C C C C C C H H H H H H H H H H H H H H H H H H
charge: 0
multiplicity: 1
keywords: wb97x-d3
keywords: def2-TZVPP
keywords: def2/J RIJCOSX GRIDX6 NOFINALGRIDX
keywords: grid4 nofinalgrid
keywords: scfconv7
keywords: smallprint printgap noloewdin
keywords: NOSOSCF
formula: C16H18ClN7O5S
InChI: InChI=1S/C16H18ClN7O5S/c1-4-5-9-6-7-10-18-13(17)14(24(10)22-9)30(26,27)23-16(25)21-15-19-11(28-2)8-12(20-15)29-3/h6-8,21,23H,4-5H2,1-3H3
48 atoms
Cl -2.303922 -1.615329 1.395226
S  -0.964175 -0.421844 -1.574816
O  -0.727953 0.42288 -2.709912
O  -1.432963 -1.780094 -1.716598
O  0.76634 1.594702 -0.199016
O  2.008324 -4.516092 0.534169
O  5.378019 -2.326874 2.862782
N  -2.414976 1.708631 -0.503765
N  -2.159336 2.578971 -1.463743
N  -3.217847 0.868176 1.401382
N  0.434075 -0.604757 -0.676567
N  2.21702 0.082408 0.642251
N  2.097783 -2.236785 0.556246
N  3.79992 -1.117635 1.746443
C  -2.009262 0.401703 -0.446837
C  -2.637824 3.776167 -1.305467
C  -2.382748 4.767891 -2.404384
C  -3.14576 1.94484 0.634804
C  -1.260262 4.406264 -3.370928
C  -3.407433 4.151018 -0.166742
C  -3.670167 3.236334 0.802562
C  -2.528723 -0.060117 0.749965
C  0.123594 4.434403 -2.737456
C  1.10055 0.440158 -0.101848
C  2.718548 -1.150713 0.987587
C  2.603949 -3.407546 0.928909
C  4.297476 -2.292088 2.104038
C  3.73526 -3.505359 1.72221
C  0.839228 -4.418814 -0.269596
C  5.960035 -1.098295 3.26909
H  -3.320591 4.891118 -2.957518
H  -2.182214 5.743376 -1.949769
H  -1.298657 5.119829 -4.197493
H  -1.446449 3.421546 -3.801727
H  -3.777221 5.164427 -0.091178
H  -4.249449 3.460607 1.686541
H  0.235332 3.669545 -1.971217
H  0.891481 4.251049 -3.48879
H  0.333317 5.406311 -2.28552
H  2.713331 0.866127 1.038773
H  4.148087 -4.454993 2.025436
H  1.045579 -3.949026 -1.232249
H  0.041797 -3.866706 0.229606
H  0.513556 -5.441408 -0.437629
H  6.294241 -0.50709 2.416138
H  6.816515 -1.368401 3.880921
H  5.266963 -0.497402 3.858414
H  0.738761 -1.556561 -0.447166
totalener: -2238.46823353 hartree
nucrepener: 3491.51841839 hartree
electener: -5729.98665193 hartree
twoeener: 4285.02333432 hartree
kineticenergy: 2231.48079458 hartree
xcener: -168.721303981877 hartree
chargesum: 0.0000000
charge: -0.030436 0.839667 -0.403919 -0.452732 -0.400742 -0.261737 -0.263124 0.191538 -0.246550 -0.268846 -0.224462 -0.162485 -0.425847 -0.407760 -0.176463 0.125840 -0.143772 0.172549 -0.063714 -0.110685 -0.145737 0.141377 -0.258925 0.355801 0.368164 0.396787 0.386243 -0.300099 -0.118625 -0.125529 0.097877 0.078874 0.065470 0.073638 0.130609 0.141282 0.107826 0.080631 0.062266 0.167168 0.129882 0.110323 0.098536 0.128499 0.108821 0.124475 0.107859 0.200188
qa: -0.0304 0.8397 -0.4039 -0.4527 -0.4007 -0.2617 -0.2631 0.1915 -0.2465 -0.2688 -0.2245 -0.1625 -0.4258 -0.4078 -0.1765 0.1258 -0.1438 0.1725 -0.0637 -0.1107 -0.1457 0.1414 -0.2589 0.3558 0.3682 0.3968 0.3862 -0.3001 -0.1186 -0.1255 0.0979 0.0789 0.0655 0.0736 0.1306 0.1413 0.1078 0.0806 0.0623 0.1672 0.1299 0.1103 0.0985 0.1285 0.1088 0.1245 0.1079 0.2002
va: 1.2909 5.9226 2.0998 2.0397 2.1066 2.1622 2.1509 3.4858 2.8899 3.1408 3.0739 3.1620 2.9755 2.9734 3.8313 3.9134 3.9348 4.0433 3.8825 3.9270 4.0591 4.1922 3.9456 4.3759 4.2374 4.0269 4.0568 3.9349 3.8687 3.8760 1.0031 1.0043 1.0032 1.0203 1.0005 1.0093 1.0035 1.0065 1.0042 1.0368 1.0215 0.9956 0.9997 0.9967 0.9967 0.9939 0.9971 1.0713
dispcorr: -0.027139261 hartree
energy: -2238.495372795608
dipole: 14.81885 -14.02954 0.78930 21.12910 -20.14979 0.97931 -9.08732 10.13614 1.04883
magnitude: 1.63771 au
magnitude: 4.16272 debye
