program: Orca
programVersion: 4.2.1
elementType: Cl S O O O O O N N N N N N N C C C C C C C C C C C C C C C C H H H H H H H H H H H H H H H H H H
charge: 0
multiplicity: 1
keywords: wb97x-d3
keywords: def2-TZVPP
keywords: def2/J RIJCOSX GRIDX6 NOFINALGRIDX
keywords: grid4 nofinalgrid
keywords: scfconv7
keywords: smallprint printgap noloewdin
keywords: NOSOSCF
formula: C16H18ClN7O5S
InChI: InChI=1S/C16H18ClN7O5S/c1-4-5-9-6-7-10-18-13(17)14(24(10)22-9)30(26,27)23-16(25)21-15-19-11(28-2)8-12(20-15)29-3/h6-8,21,23H,4-5H2,1-3H3
48 atoms
Cl -1.047864 -1.064231 -2.670604
S  -1.61373 -0.734066 0.735408
O  -1.988184 -2.051373 0.27804
O  -2.071707 -0.205571 1.987821
O  0.427493 1.435215 1.011579
O  2.285298 -4.349775 -0.566474
O  6.197645 -1.85679 -0.351102
N  -2.441543 1.681703 -0.394332
N  -2.818336 2.266547 0.728351
N  -2.018169 1.395741 -2.566634
N  0.057166 -0.787554 0.693709
N  2.20549 0.091727 0.646062
N  2.218364 -2.155678 0.054424
N  4.200571 -0.88018 0.155944
C  -1.962853 0.406776 -0.538421
C  -3.230093 3.494673 0.634006
C  -3.690146 4.163648 1.897584
C  -2.459458 2.240925 -1.648537
C  -3.28081 3.475709 3.195178
C  -3.289607 4.191501 -0.607282
C  -2.913196 3.565612 -1.752541
C  -1.715237 0.292023 -1.89512
C  -1.785924 3.535596 3.47611
C  0.845563 0.323092 0.805871
C  2.893656 -1.038524 0.270936
C  2.919398 -3.218787 -0.325534
C  4.887055 -1.950133 -0.216478
C  4.295309 -3.180442 -0.480926
C  0.870722 -4.387265 -0.425453
C  6.817181 -0.605747 -0.097701
H  -3.326792 5.196367 1.892731
H  -4.782163 4.239151 1.848024
H  -3.609564 2.435659 3.181548
H  -3.824461 3.963027 4.008115
H  -3.64045 5.214337 -0.620609
H  -2.939889 4.040242 -2.722742
H  -1.564237 3.108184 4.453863
H  -1.210771 2.974111 2.742321
H  -1.424086 4.56603 3.480265
H  2.776753 0.915924 0.756346
H  4.866251 -4.042473 -0.789325
H  0.372909 -3.682356 -1.092679
H  0.558114 -4.1844 0.599764
H  0.576658 -5.398468 -0.69174
H  7.878059 -0.763925 -0.272037
H  6.662107 -0.278079 0.930491
H  6.450173 0.170919 -0.769194
H  0.503161 -1.666755 0.410731
totalener: -2238.46810837 hartree
nucrepener: 3497.07576565 hartree
electener: -5735.54387403 hartree
twoeener: 4290.56448512 hartree
kineticenergy: 2231.48063380 hartree
xcener: -168.721180392180 hartree
chargesum: -0.0000000
charge: -0.031273 0.840181 -0.452801 -0.403369 -0.397752 -0.261645 -0.262985 0.190478 -0.244296 -0.268804 -0.224566 -0.162575 -0.423782 -0.407170 -0.180105 0.122802 -0.143699 0.172364 -0.062809 -0.107680 -0.145995 0.143462 -0.258799 0.352224 0.367422 0.395322 0.385492 -0.299855 -0.117666 -0.126024 0.078789 0.098250 0.072329 0.065647 0.130702 0.141941 0.080376 0.108720 0.062233 0.167410 0.129618 0.100016 0.109468 0.127486 0.124051 0.109067 0.108312 0.199489
qa: -0.0313 0.8402 -0.4528 -0.4034 -0.3978 -0.2616 -0.2630 0.1905 -0.2443 -0.2688 -0.2246 -0.1626 -0.4238 -0.4072 -0.1801 0.1228 -0.1437 0.1724 -0.0628 -0.1077 -0.1460 0.1435 -0.2588 0.3522 0.3674 0.3953 0.3855 -0.2999 -0.1177 -0.1260 0.0788 0.0983 0.0723 0.0656 0.1307 0.1419 0.0804 0.1087 0.0622 0.1674 0.1296 0.1000 0.1095 0.1275 0.1241 0.1091 0.1083 0.1995
va: 1.2902 5.9223 2.0393 2.1002 2.1082 2.1621 2.1509 3.4873 2.8901 3.1416 3.0714 3.1616 2.9759 2.9734 3.8312 3.9161 3.9382 4.0424 3.8829 3.9272 4.0607 4.1880 3.9452 4.3785 4.2376 4.0288 4.0572 3.9352 3.8686 3.8760 1.0042 1.0024 1.0205 1.0030 1.0007 1.0090 1.0067 1.0031 1.0040 1.0366 1.0216 0.9995 0.9950 0.9968 0.9940 0.9966 0.9969 1.0744
dispcorr: -0.027302347 hartree
energy: -2238.495410719234
dipole: 5.47945 -4.36251 1.11694 17.06664 -15.90091 1.16573 19.79577 -20.07774 -0.28197
magnitude: 1.63890 au
magnitude: 4.16576 debye
