program: Orca
programVersion: 4.2.1
elementType: Cl S O O O O O N N N N N N N C C C C C C C C C C C C C C C C H H H H H H H H H H H H H H H H H H
charge: 0
multiplicity: 1
keywords: wb97x-d3
keywords: def2-TZVPP
keywords: def2/J RIJCOSX GRIDX6 NOFINALGRIDX
keywords: grid4 nofinalgrid
keywords: scfconv7
keywords: smallprint printgap noloewdin
keywords: NOSOSCF
formula: C16H18ClN7O5S
InChI: InChI=1S/C16H18ClN7O5S/c1-4-5-9-6-7-10-18-13(17)14(24(10)22-9)30(26,27)23-16(25)21-15-19-11(28-2)8-12(20-15)29-3/h6-8,21,23H,4-5H2,1-3H3
48 atoms
Cl -2.100911 -1.601487 1.427011
S  -0.969907 -0.414468 -1.627377
O  -0.777072 0.43944 -2.763526
O  -1.437693 -1.773798 -1.762265
O  0.790232 1.607958 -0.309116
O  1.942648 -4.500025 0.564512
O  5.21732 -2.303431 3.017773
N  -2.411469 1.69436 -0.497554
N  -2.238129 2.557322 -1.482267
N  -3.068535 0.861629 1.465641
N  0.458168 -0.594646 -0.775494
N  2.213731 0.096435 0.578743
N  2.065859 -2.22224 0.538171
N  3.71989 -1.098802 1.790515
C  -1.975147 0.397172 -0.453774
C  -2.725795 3.747812 -1.304494
C  -2.558652 4.733117 -2.425579
C  -3.069761 1.930024 0.684433
C  -1.541806 4.348394 -3.494774
C  -3.425509 4.121763 -0.120995
C  -3.606701 3.213733 0.872794
C  -2.404875 -0.060186 0.779504
C  -0.100639 4.366098 -3.004886
C  1.116012 0.452745 -0.193613
C  2.678865 -1.13504 0.977163
C  2.533288 -3.390771 0.964681
C  4.179475 -2.271202 2.201494
C  3.619391 -3.485302 1.819134
C  0.817243 -4.405221 -0.29952
C  5.792937 -1.074346 3.430987
H  -3.54295 4.877023 -2.88497
H  -2.294501 5.70393 -1.993587
H  -1.65506 5.053939 -4.321387
H  -1.781068 3.36187 -3.894139
H  -3.808613 5.129097 -0.031354
H  -4.130264 3.437992 1.790862
H  0.584892 4.166623 -3.828348
H  0.163775 5.34018 -2.587689
H  0.080705 3.608002 -2.245064
H  2.702805 0.881903 0.980792
H  4.00068 -4.432909 2.166795
H  0.490843 -5.4274 -0.468561
H  1.076867 -3.95198 -1.257218
H  0.000773 -3.83862 0.15004
H  5.077252 -0.453259 3.97035
H  6.1806 -0.504449 2.586188
H  6.611442 -1.342723 4.093511
H  0.751127 -1.544884 -0.524666
totalener: -2238.46796637 hartree
nucrepener: 3500.78184064 hartree
electener: -5739.24980701 hartree
twoeener: 4294.25823876 hartree
kineticenergy: 2231.48098072 hartree
xcener: -168.721125988014 hartree
chargesum: -0.0000000
charge: -0.032172 0.841046 -0.402881 -0.452604 -0.396081 -0.261818 -0.263094 0.189519 -0.245266 -0.269189 -0.225276 -0.161842 -0.424088 -0.406990 -0.178211 0.125657 -0.145397 0.173191 -0.064194 -0.111094 -0.145578 0.143440 -0.257132 0.348722 0.367891 0.396064 0.385815 -0.300357 -0.119478 -0.125680 0.098304 0.079510 0.066368 0.072131 0.131687 0.141677 0.080569 0.062529 0.108344 0.167166 0.129374 0.128451 0.109977 0.099545 0.108232 0.108736 0.124312 0.200164
qa: -0.0322 0.8410 -0.4029 -0.4526 -0.3961 -0.2618 -0.2631 0.1895 -0.2453 -0.2692 -0.2253 -0.1618 -0.4241 -0.4070 -0.1782 0.1257 -0.1454 0.1732 -0.0642 -0.1111 -0.1456 0.1434 -0.2571 0.3487 0.3679 0.3961 0.3858 -0.3004 -0.1195 -0.1257 0.0983 0.0795 0.0664 0.0721 0.1317 0.1417 0.0806 0.0625 0.1083 0.1672 0.1294 0.1285 0.1100 0.0995 0.1082 0.1087 0.1243 0.2002
va: 1.2894 5.9219 2.1008 2.0395 2.1090 2.1620 2.1508 3.4898 2.8892 3.1411 3.0711 3.1620 2.9746 2.9735 3.8335 3.9130 3.9393 4.0429 3.8814 3.9270 4.0597 4.1850 3.9447 4.3810 4.2369 4.0284 4.0565 3.9351 3.8682 3.8759 1.0030 1.0041 1.0028 1.0207 1.0002 1.0090 1.0064 1.0041 1.0033 1.0366 1.0216 0.9969 0.9949 0.9999 0.9969 0.9967 0.9939 1.0737
dispcorr: -0.027412320 hartree
energy: -2238.495378689797
dipole: 12.82841 -12.12341 0.70500 20.83405 -19.85402 0.98004 -9.59016 10.69159 1.10143
magnitude: 1.63421 au
magnitude: 4.15384 debye
