program: Orca
programVersion: 4.2.1
elementType: Cl S O O O O O N N N N N N N C C C C C C C C C C C C C C C C H H H H H H H H H H H H H H H H H H
charge: 0
multiplicity: 1
keywords: wb97x-d3
keywords: def2-TZVPP
keywords: def2/J RIJCOSX GRIDX6 NOFINALGRIDX
keywords: grid4 nofinalgrid
keywords: scfconv7
keywords: smallprint printgap noloewdin
keywords: NOSOSCF
formula: C16H18ClN7O5S
InChI: InChI=1S/C16H18ClN7O5S/c1-4-5-9-6-7-10-18-13(17)14(24(10)22-9)30(26,27)23-16(25)21-15-19-11(28-2)8-12(20-15)29-3/h6-8,21,23H,4-5H2,1-3H3
48 atoms
Cl -2.36364 -1.526831 1.547353
S  -1.069512 -0.584288 -1.524811
O  -0.831861 0.171035 -2.720824
O  -1.575908 -1.936088 -1.562093
O  0.719349 1.473365 -0.288529
O  2.005201 -4.613088 0.578079
O  5.512805 -2.351832 2.616744
N  -2.408871 1.666999 -0.565832
N  -2.160411 2.457862 -1.594954
N  -3.165022 0.991963 1.423687
N  0.341103 -0.742027 -0.638371
N  2.196511 -0.013203 0.552256
N  2.081615 -2.333895 0.540039
N  3.854812 -1.177557 1.581724
C  -2.063515 0.347619 -0.437819
C  -2.571441 3.688146 -1.4894
C  -2.25437 4.604328 -2.630393
C  -3.074387 2.012733 0.585815
C  -1.026189 5.479673 -2.353664
C  -3.265135 4.173884 -0.345464
C  -3.528547 3.336139 0.691568
C  -2.548372 -0.008776 0.808611
C  0.269938 4.688015 -2.264099
C  1.046835 0.320705 -0.151761
C  2.725136 -1.234521 0.897925
C  2.619519 -3.492693 0.90535
C  4.38217 -2.340449 1.933972
C  3.80326 -3.565612 1.620928
C  0.78491 -4.539471 -0.14826
C  6.114495 -1.111529 2.952055
H  -2.083828 4.004455 -3.525398
H  -3.120359 5.241982 -2.82657
H  -1.181668 6.051749 -1.433791
H  -0.951904 6.217368 -3.156228
H  -3.585234 5.206575 -0.321904
H  -4.060345 3.643014 1.580511
H  0.448276 4.124792 -3.1808
H  1.118198 5.356125 -2.113993
H  0.266578 3.968651 -1.44652
H  2.716221 0.782886 0.889624
H  4.242975 -4.5053 1.917253
H  0.458684 -5.567476 -0.277706
H  0.922219 -4.08435 -1.130092
H  0.016964 -3.985859 0.393824
H  7.01725 -1.363465 3.502018
H  5.463669 -0.503124 3.580611
H  6.377941 -0.535702 2.064524
H  0.656769 -1.686191 -0.394404
totalener: -2238.46804073 hartree
nucrepener: 3480.22204497 hartree
electener: -5718.69008570 hartree
oneelecener: -9992.37301707 hartree
twoeener: 4273.68293138 hartree
kineticenergy: 2231.48336509 hartree
xcener: -168.719657235559 hartree
chargesum: 0.0000000
charge: -0.029154 0.834012 -0.399252 -0.453096 -0.405695 -0.261548 -0.263261 0.202661 -0.232264 -0.268230 -0.225439 -0.163790 -0.426066 -0.408319 -0.166787 0.091836 -0.140172 0.181811 -0.114792 -0.076855 -0.163792 0.135727 -0.226783 0.364004 0.367440 0.397295 0.386529 -0.300816 -0.120627 -0.125638 0.099970 0.088051 0.056062 0.069866 0.132318 0.141848 0.078807 0.078913 0.088000 0.166667 0.130032 0.128525 0.109802 0.101361 0.124559 0.107702 0.108600 0.199979
qa: -0.0292 0.8340 -0.3993 -0.4531 -0.4057 -0.2615 -0.2633 0.2027 -0.2323 -0.2682 -0.2254 -0.1638 -0.4261 -0.4083 -0.1668 0.0918 -0.1402 0.1818 -0.1148 -0.0769 -0.1638 0.1357 -0.2268 0.3640 0.3674 0.3973 0.3865 -0.3008 -0.1206 -0.1256 0.1000 0.0881 0.0561 0.0699 0.1323 0.1418 0.0788 0.0789 0.0880 0.1667 0.1300 0.1285 0.1098 0.1014 0.1246 0.1077 0.1086 0.2000
va: 1.2929 5.9308 2.1081 2.0380 2.1025 2.1620 2.1507 3.4601 2.8894 3.1382 3.0781 3.1625 2.9742 2.9737 3.8303 3.9483 3.8857 4.0311 3.9032 3.8666 4.0779 4.1968 3.9304 4.3675 4.2393 4.0254 4.0567 3.9349 3.8681 3.8764 1.0224 1.0066 1.0081 1.0087 0.9987 1.0096 1.0067 1.0037 1.0149 1.0372 1.0214 0.9964 0.9959 0.9991 0.9938 0.9970 0.9967 1.0692
dispcorr: -0.026873331 hartree
energy: -2238.494914059188
dipole: 16.51048 -15.52379 0.98669 23.15521 -22.01706 1.13816 -7.66853 8.60764 0.93911
magnitude: 1.77508 au
magnitude: 4.51189 debye
