program: Orca
programVersion: 4.2.1
elementType: Cl S O O O O O N N N N N N N C C C C C C C C C C C C C C C C H H H H H H H H H H H H H H H H H H
charge: 0
multiplicity: 1
keywords: wb97x-d3
keywords: def2-TZVPP
keywords: def2/J RIJCOSX GRIDX6 NOFINALGRIDX
keywords: grid4 nofinalgrid
keywords: scfconv7
keywords: smallprint printgap noloewdin
keywords: NOSOSCF
formula: C16H18ClN7O5S
InChI: InChI=1S/C16H18ClN7O5S/c1-4-5-9-6-7-10-18-13(17)14(24(10)22-9)30(26,27)23-16(25)21-15-19-11(28-2)8-12(20-15)29-3/h6-8,21,23H,4-5H2,1-3H3
48 atoms
Cl -4.809715 -0.84545 -1.722391
S  -2.053202 -1.298618 0.517226
O  -2.734224 -2.417311 -0.070736
O  -1.936705 -1.143364 1.948753
O  -0.849561 -1.124518 -2.240299
O  2.930024 -1.276595 2.790401
O  5.786521 -0.910874 -0.852277
N  -2.262736 1.390837 0.060759
N  -1.215163 1.697938 0.80754
N  -3.994129 1.62666 -1.318942
N  -0.469121 -1.227574 0.003339
N  1.287585 -1.111036 -1.51033
N  2.086733 -1.193786 0.671379
N  3.533473 -1.015635 -1.184517
C  -2.745791 0.135175 -0.180966
C  -0.914358 2.963353 0.883762
C  0.257231 3.330314 1.751291
C  -3.050744 2.264511 -0.650537
C  1.44449 2.376738 1.656008
C  -1.659141 3.96915 0.208939
C  -2.728369 3.625861 -0.559724
C  -3.808835 0.33665 -1.047757
C  2.089347 2.35283 0.278733
C  -0.089037 -1.162961 -1.309252
C  2.338302 -1.108861 -0.625877
C  3.133058 -1.182152 1.489929
C  4.566074 -0.999798 -0.355867
C  4.43426 -1.074215 1.027175
C  1.604264 -1.462239 3.269343
C  5.941884 -0.848938 -2.261539
H  0.578459 4.343475 1.496407
H  -0.091049 3.378047 2.787667
H  1.12373 1.371224 1.930861
H  2.182261 2.680516 2.401727
H  -1.359292 5.002622 0.311313
H  -3.322105 4.348335 -1.100762
H  1.410033 1.962092 -0.479486
H  2.39541 3.352551 -0.034972
H  2.980992 1.725425 0.275447
H  1.554355 -1.052632 -2.481659
H  5.285344 -1.067458 1.690465
H  1.692615 -1.549013 4.348549
H  1.152115 -2.372071 2.873086
H  0.956819 -0.617003 3.032617
H  5.545119 -1.738416 -2.751483
H  7.012744 -0.786546 -2.435309
H  5.452414 0.02861 -2.684634
H  0.260263 -1.188615 0.720895
totalener: -2238.46840592 hartree
nucrepener: 3584.94145205 hartree
electener: -5823.40985797 hartree
twoeener: 4377.61214807 hartree
kineticenergy: 2231.48728169 hartree
xcener: -168.724282498036 hartree
chargesum: 0.0000000
charge: 0.007024 0.852237 -0.413450 -0.456402 -0.360147 -0.259567 -0.262180 0.199274 -0.295408 -0.261931 -0.212740 -0.155944 -0.403928 -0.393886 -0.204517 0.088896 -0.126746 0.169312 -0.050906 -0.081635 -0.144638 0.182433 -0.281380 0.330068 0.320106 0.374201 0.376561 -0.288310 -0.127131 -0.125997 0.080161 0.097802 0.036106 0.082353 0.125329 0.144255 0.081234 0.093807 0.081092 0.168599 0.128502 0.130181 0.115984 0.105494 0.109587 0.124941 0.107656 0.193648
qa: 0.0070 0.8522 -0.4134 -0.4564 -0.3601 -0.2596 -0.2622 0.1993 -0.2954 -0.2619 -0.2127 -0.1559 -0.4039 -0.3939 -0.2045 0.0889 -0.1267 0.1693 -0.0509 -0.0816 -0.1446 0.1824 -0.2814 0.3301 0.3201 0.3742 0.3766 -0.2883 -0.1271 -0.1260 0.0802 0.0978 0.0361 0.0824 0.1253 0.1443 0.0812 0.0938 0.0811 0.1686 0.1285 0.1302 0.1160 0.1055 0.1096 0.1249 0.1077 0.1936
va: 1.3267 5.9011 2.0992 2.0278 2.1553 2.1506 2.1529 3.4315 2.8800 3.1363 3.0719 3.1592 2.9174 2.9524 3.8717 3.9519 3.9132 4.0569 3.8602 3.9015 4.0699 4.1914 3.9569 4.4028 4.2605 4.0140 4.0603 3.9245 3.8706 3.8761 1.0078 1.0082 1.0264 1.0097 1.0028 1.0087 1.0032 1.0075 1.0132 1.0356 1.0226 0.9951 0.9956 0.9846 0.9972 0.9938 0.9967 1.0738
dispcorr: -0.030991867 hartree
energy: -2238.499397783686
dipole: 40.40527 -37.54456 2.86071 17.75403 -15.54107 2.21296 11.62858 -11.07091 0.55767
magnitude: 3.65949 au
magnitude: 9.30167 debye
