program: Orca
programVersion: 4.2.1
elementType: Cl S O O O O O N N N N N N N C C C C C C C C C C C C C C C C H H H H H H H H H H H H H H H H H H
charge: 0
multiplicity: 1
keywords: wb97x-d3
keywords: def2-TZVPP
keywords: def2/J RIJCOSX GRIDX6 NOFINALGRIDX
keywords: grid4 nofinalgrid
keywords: scfconv7
keywords: smallprint printgap noloewdin
keywords: NOSOSCF
formula: C16H18ClN7O5S
InChI: InChI=1S/C16H18ClN7O5S/c1-4-5-9-6-7-10-18-13(17)14(24(10)22-9)30(26,27)23-16(25)21-15-19-11(28-2)8-12(20-15)29-3/h6-8,21,23H,4-5H2,1-3H3
48 atoms
Cl -4.788597 -0.785081 -1.798353
S  -2.049361 -1.328747 0.443702
O  -2.730229 -2.42307 -0.188793
O  -1.942896 -1.224752 1.880704
O  -0.824642 -1.05913 -2.296771
O  2.917629 -1.359696 2.755452
O  5.797647 -0.836547 -0.849812
N  -2.247599 1.376103 0.082912
N  -1.206052 1.652483 0.849915
N  -3.967451 1.667764 -1.300545
N  -0.461454 -1.245123 -0.055532
N  1.306444 -1.060628 -1.549721
N  2.089977 -1.215117 0.633682
N  3.548524 -0.9542 -1.203085
C  -2.73243 0.131601 -0.208154
C  -0.903042 2.913542 0.975385
C  0.262692 3.244129 1.865252
C  -3.027133 2.277659 -0.602346
C  1.457789 2.306752 1.720032
C  -1.638458 3.945561 0.330635
C  -2.701594 3.633809 -0.459696
C  -3.788409 0.368075 -1.074847
C  2.094125 2.351907 0.339479
C  -0.071188 -1.128051 -1.361725
C  2.350354 -1.080528 -0.657486
C  3.129968 -1.219891 1.460599
C  4.574659 -0.957017 -0.366419
C  4.433331 -1.082256 1.012105
C  1.590192 -1.575374 3.21707
C  5.961686 -0.716104 -2.254452
H  0.575609 4.272117 1.665573
H  -0.087465 3.232632 2.90199
H  1.147242 1.287141 1.95011
H  2.197214 2.582444 2.474964
H  -1.336366 4.973552 0.473564
H  -3.288837 4.377205 -0.979122
H  2.993548 1.736874 0.302683
H  1.414786 1.986704 -0.43145
H  2.385554 3.368361 0.068478
H  1.579358 -0.963969 -2.516274
H  5.279468 -1.08912 1.681674
H  0.933253 -0.732919 2.996648
H  1.670151 -1.689337 4.294418
H  1.154023 -2.480582 2.792944
H  7.032809 -0.634435 -2.417952
H  5.464562 0.172231 -2.644809
H  5.578399 -1.589389 -2.782623
H  0.262205 -1.227204 0.668738
totalener: -2238.46836563 hartree
nucrepener: 3586.74531466 hartree
electener: -5825.21368030 hartree
twoeener: 4379.40347000 hartree
kineticenergy: 2231.48623473 hartree
xcener: -168.724047127117 hartree
chargesum: 0.0000000
charge: 0.007202 0.852563 -0.413485 -0.456270 -0.359961 -0.259538 -0.262161 0.200360 -0.295910 -0.261955 -0.212388 -0.155700 -0.403777 -0.393899 -0.205606 0.087061 -0.127737 0.169361 -0.048851 -0.079412 -0.144768 0.182457 -0.284599 0.329400 0.320503 0.373051 0.374836 -0.286649 -0.126038 -0.126123 0.080331 0.097431 0.034389 0.082720 0.125216 0.144485 0.082742 0.082215 0.093984 0.168724 0.128507 0.104732 0.130101 0.116229 0.124845 0.107814 0.109810 0.193755
qa: 0.0072 0.8526 -0.4135 -0.4563 -0.3600 -0.2595 -0.2622 0.2004 -0.2959 -0.2620 -0.2124 -0.1557 -0.4038 -0.3939 -0.2056 0.0871 -0.1277 0.1694 -0.0489 -0.0794 -0.1448 0.1825 -0.2846 0.3294 0.3205 0.3731 0.3748 -0.2866 -0.1260 -0.1261 0.0803 0.0974 0.0344 0.0827 0.1252 0.1445 0.0827 0.0822 0.0940 0.1687 0.1285 0.1047 0.1301 0.1162 0.1248 0.1078 0.1098 0.1938
va: 1.3271 5.9005 2.0991 2.0279 2.1553 2.1501 2.1527 3.4289 2.8790 3.1364 3.0715 3.1594 2.9169 2.9511 3.8714 3.9540 3.9124 4.0563 3.8572 3.8994 4.0707 4.1914 3.9591 4.4033 4.2590 4.0152 4.0608 3.9242 3.8701 3.8760 1.0080 1.0086 1.0277 1.0098 1.0029 1.0087 1.0125 1.0027 1.0073 1.0355 1.0226 0.9855 0.9951 0.9954 0.9938 0.9967 0.9972 1.0737
dispcorr: -0.031063212 hartree
energy: -2238.499428843691
dipole: 40.34722 -37.48368 2.86355 17.45035 -15.24907 2.20128 12.47873 -11.82056 0.65817
magnitude: 3.67134 au
magnitude: 9.33180 debye
