program: Orca
programVersion: 4.2.1
elementType: Cl S O O O O O N N N N N N N C C C C C C C C C C C C C C C C H H H H H H H H H H H H H H H H H H
charge: 0
multiplicity: 1
keywords: wb97x-d3
keywords: def2-TZVPP
keywords: def2/J RIJCOSX GRIDX6 NOFINALGRIDX
keywords: grid4 nofinalgrid
keywords: scfconv7
keywords: smallprint printgap noloewdin
keywords: NOSOSCF
formula: C16H18ClN7O5S
InChI: InChI=1S/C16H18ClN7O5S/c1-4-5-9-6-7-10-18-13(17)14(24(10)22-9)30(26,27)23-16(25)21-15-19-11(28-2)8-12(20-15)29-3/h6-8,21,23H,4-5H2,1-3H3
48 atoms
Cl -2.216017 -1.517704 1.578756
S  -1.079277 -0.591827 -1.559386
O  -0.883273 0.163189 -2.762663
O  -1.583575 -1.944695 -1.57833
O  0.744436 1.475619 -0.393112
O  1.929166 -4.600826 0.654989
O  5.418223 -2.333098 2.717639
N  -2.408505 1.651132 -0.56343
N  -2.224298 2.43252 -1.613555
N  -3.055854 0.989604 1.468272
N  0.359477 -0.742932 -0.719789
N  2.204033 -0.008003 0.48342
N  2.049402 -2.325856 0.540772
N  3.812873 -1.166165 1.595069
C  -2.040194 0.337671 -0.439317
C  -2.643442 3.65908 -1.499817
C  -2.397442 4.565456 -2.665668
C  -3.020037 2.001827 0.615731
C  -1.167641 5.458308 -2.461179
C  -3.28164 4.150777 -0.326101
C  -3.482968 3.321566 0.731307
C  -2.458721 -0.010284 0.833104
C  0.140743 4.682558 -2.424284
C  1.064401 0.323314 -0.237943
C  2.701692 -1.226381 0.882202
C  2.55476 -3.480745 0.960846
C  4.308748 -2.325531 2.00091
C  3.716038 -3.550074 1.712809
C  0.727978 -4.531106 -0.103016
C  6.031434 -1.092314 3.029496
H  -2.264254 3.9571 -3.561251
H  -3.280629 5.189779 -2.824364
H  -1.285179 6.041519 -1.542728
H  -1.141147 6.185146 -3.276472
H  -3.60943 5.180908 -0.297028
H  -3.971765 3.632132 1.643356
H  0.28215 4.11031 -3.341809
H  0.987427 5.361502 -2.322079
H  0.184175 3.973006 -1.599193
H  2.726627 0.790055 0.811609
H  4.128497 -4.486885 2.054049
H  0.386776 -5.557227 -0.205992
H  0.896815 -4.111498 -1.095663
H  -0.042589 -3.946581 0.401442
H  5.371374 -0.450197 3.613266
H  6.335391 -0.553722 2.131581
H  6.910287 -1.34007 3.618639
H  0.6604 -1.683619 -0.444743
totalener: -2238.46799268 hartree
nucrepener: 3486.34077475 hartree
electener: -5724.80876743 hartree
twoeener: 4279.77238065 hartree
kineticenergy: 2231.48463800 hartree
xcener: -168.719762940825 hartree
chargesum: -0.0000000
charge: -0.030843 0.835590 -0.398697 -0.453407 -0.402388 -0.261655 -0.263234 0.203489 -0.232707 -0.268473 -0.226006 -0.163284 -0.424061 -0.408028 -0.169176 0.090321 -0.140419 0.182371 -0.114515 -0.075160 -0.164366 0.137240 -0.226185 0.360024 0.366614 0.396748 0.386683 -0.301269 -0.119348 -0.125635 0.100065 0.088203 0.055948 0.069776 0.132380 0.142019 0.079335 0.078924 0.087712 0.166639 0.129594 0.128218 0.109977 0.100500 0.107629 0.108803 0.124469 0.199583
qa: -0.0308 0.8356 -0.3987 -0.4534 -0.4024 -0.2617 -0.2632 0.2035 -0.2327 -0.2685 -0.2260 -0.1633 -0.4241 -0.4080 -0.1692 0.0903 -0.1404 0.1824 -0.1145 -0.0752 -0.1644 0.1372 -0.2262 0.3600 0.3666 0.3967 0.3867 -0.3013 -0.1193 -0.1256 0.1001 0.0882 0.0559 0.0698 0.1324 0.1420 0.0793 0.0789 0.0877 0.1666 0.1296 0.1282 0.1100 0.1005 0.1076 0.1088 0.1245 0.1996
va: 1.2910 5.9320 2.1090 2.0378 2.1040 2.1621 2.1506 3.4596 2.8896 3.1386 3.0758 3.1622 2.9751 2.9738 3.8308 3.9492 3.8859 4.0305 3.9028 3.8655 4.0782 4.1920 3.9308 4.3692 4.2400 4.0265 4.0559 3.9354 3.8684 3.8763 1.0224 1.0066 1.0082 1.0087 0.9986 1.0095 1.0067 1.0035 1.0145 1.0372 1.0216 0.9966 0.9954 0.9992 0.9971 0.9967 0.9939 1.0720
dispcorr: -0.027053689 hartree
energy: -2238.495046370526
dipole: 15.21841 -14.28610 0.93232 23.10404 -21.95535 1.14869 -8.00445 8.97353 0.96909
magnitude: 1.76857 au
magnitude: 4.49534 debye
