program: Orca
programVersion: 4.2.1
elementType: Cl S O O O O O N N N N N N N C C C C C C C C C C C C C C C C H H H H H H H H H H H H H H H H H H
charge: 0
multiplicity: 1
keywords: wb97x-d3
keywords: def2-TZVPP
keywords: def2/J RIJCOSX GRIDX6 NOFINALGRIDX
keywords: grid4 nofinalgrid
keywords: scfconv7
keywords: smallprint printgap noloewdin
keywords: NOSOSCF
formula: C16H18ClN7O5S
InChI: InChI=1S/C16H18ClN7O5S/c1-4-5-9-6-7-10-18-13(17)14(24(10)22-9)30(26,27)23-16(25)21-15-19-11(28-2)8-12(20-15)29-3/h6-8,21,23H,4-5H2,1-3H3
48 atoms
Cl -4.878217 -0.250496 -1.798099
S  -2.060381 -1.643723 -0.080165
O  -2.841787 -2.447206 -0.97539
O  -1.951026 -1.950991 1.327723
O  -0.794124 -0.799823 -2.693696
O  2.713071 -1.63187 2.431704
O  5.688817 -0.178666 -0.826968
N  -1.960458 1.065656 0.303837
N  -0.828128 1.02514 0.989492
N  -3.750654 1.88325 -0.736858
N  -0.469565 -1.569535 -0.570259
N  1.315385 -0.883764 -1.887853
N  2.007461 -1.30569 0.288878
N  3.503066 -0.539711 -1.366183
C  -2.601972 0.001677 -0.267292
C  -0.376361 2.169672 1.421417
C  0.941048 2.137197 2.135961
C  -2.692909 2.187385 -0.008436
C  2.132167 2.319579 1.188241
C  -1.059009 3.39708 1.19659
C  -2.215147 3.412365 0.478998
C  -3.696612 0.563046 -0.904948
C  2.198103 3.68049 0.512289
C  -0.062185 -1.07124 -1.779866
C  2.309612 -0.920127 -0.940699
C  2.984402 -1.285522 1.187949
C  4.472283 -0.542627 -0.463351
C  4.276685 -0.904097 0.865931
C  1.384554 -2.028025 2.75674
C  5.911036 0.187441 -2.179771
H  0.960183 2.915518 2.903201
H  1.037488 1.180903 2.651224
H  2.100431 1.534694 0.430336
H  3.046652 2.151466 1.760985
H  -0.64355 4.310124 1.599219
H  -2.769014 4.316844 0.273008
H  2.220802 4.490123 1.244317
H  3.099082 3.765452 -0.094648
H  1.348315 3.853033 -0.149133
H  1.609379 -0.553594 -2.794841
H  5.075323 -0.893429 1.591456
H  1.394749 -2.237625 3.8226
H  1.087492 -2.929199 2.219124
H  0.65724 -1.241646 2.549457
H  6.966813 0.435943 -2.245976
H  5.314598 1.053408 -2.468471
H  5.686539 -0.631968 -2.862931
H  0.237409 -1.629301 0.170677
totalener: -2238.46794893 hartree
nucrepener: 3608.75687673 hartree
electener: -5847.22482566 hartree
twoeener: 4401.03656125 hartree
kineticenergy: 2231.48589416 hartree
xcener: -168.722623275893 hartree
chargesum: 0.0000000
charge: 0.008122 0.851570 -0.408516 -0.456388 -0.349980 -0.262947 -0.262394 0.194722 -0.295878 -0.261691 -0.218195 -0.159547 -0.392688 -0.400370 -0.187701 0.150522 -0.174379 0.168137 -0.077233 -0.145046 -0.129258 0.164942 -0.288668 0.318338 0.321937 0.390742 0.401628 -0.328406 -0.116902 -0.125479 0.101641 0.107454 0.045643 0.086869 0.136906 0.145042 0.086673 0.095249 0.087700 0.168354 0.126338 0.128864 0.120581 0.087217 0.124948 0.106029 0.110543 0.204957
qa: 0.0081 0.8516 -0.4085 -0.4564 -0.3500 -0.2629 -0.2624 0.1947 -0.2959 -0.2617 -0.2182 -0.1595 -0.3927 -0.4004 -0.1877 0.1505 -0.1744 0.1681 -0.0772 -0.1450 -0.1293 0.1649 -0.2887 0.3183 0.3219 0.3907 0.4016 -0.3284 -0.1169 -0.1255 0.1016 0.1075 0.0456 0.0869 0.1369 0.1450 0.0867 0.0952 0.0877 0.1684 0.1263 0.1289 0.1206 0.0872 0.1249 0.1060 0.1105 0.2050
va: 1.3282 5.9060 2.1028 2.0283 2.1623 2.1445 2.1521 3.4289 2.9180 3.1368 3.0773 3.1588 2.9371 2.9502 3.8586 3.8748 3.9138 4.0597 3.8601 3.9061 4.0609 4.2076 3.9500 4.4178 4.2554 3.9925 4.0247 3.9099 3.8607 3.8765 1.0096 1.0147 1.0170 1.0062 0.9979 1.0078 1.0006 1.0102 0.9967 1.0350 1.0239 0.9963 0.9967 0.9985 0.9939 0.9966 0.9970 1.0731
dispcorr: -0.031460558 hartree
energy: -2238.499409484247
dipole: 42.38548 -39.24855 3.13693 18.88482 -16.76631 2.11851 13.93341 -12.78564 1.14777
magnitude: 3.95547 au
magnitude: 10.05401 debye
