program: Orca
programVersion: 4.2.1
elementType: Cl S O O O O O N N N N N N N C C C C C C C C C C C C C C C C H H H H H H H H H H H H H H H H H H
charge: 0
multiplicity: 1
keywords: wb97x-d3
keywords: def2-TZVPP
keywords: def2/J RIJCOSX GRIDX6 NOFINALGRIDX
keywords: grid4 nofinalgrid
keywords: scfconv7
keywords: smallprint printgap noloewdin
keywords: NOSOSCF
formula: C16H18ClN7O5S
InChI: InChI=1S/C16H18ClN7O5S/c1-4-5-9-6-7-10-18-13(17)14(24(10)22-9)30(26,27)23-16(25)21-15-19-11(28-2)8-12(20-15)29-3/h6-8,21,23H,4-5H2,1-3H3
48 atoms
Cl -4.94054 -0.314529 1.210038
S  -1.863957 -1.642992 -0.075812
O  -1.473489 -1.879298 -1.446661
O  -2.796855 -2.491535 0.607424
O  -1.177329 -0.928378 2.772261
O  5.529512 -0.095883 2.322339
O  3.338843 -1.437105 -1.549731
N  -1.711729 1.077182 -0.304627
N  -0.482922 1.055433 -0.801534
N  -3.638368 1.861397 0.485444
N  -0.404366 -1.584362 0.727847
N  1.052306 -0.918563 2.411001
N  3.289239 -0.513385 2.371945
N  2.189211 -1.212019 0.406385
C  -2.446416 -0.008453 0.084059
C  0.042876 2.215068 -1.078592
C  1.424593 2.216322 -1.655835
C  -2.473754 2.190389 -0.040738
C  1.446045 2.602071 -3.137738
C  -0.649218 3.441516 -0.871758
C  -1.905852 3.435578 -0.351767
C  -3.624238 0.531763 0.572878
C  0.679469 1.630677 -4.021979
C  -0.266279 -1.136261 2.016272
C  2.220162 -0.886493 1.688835
C  4.425757 -0.459467 1.694716
C  3.333947 -1.142179 -0.262814
C  4.521798 -0.762865 0.340065
C  5.450796 0.211553 3.705681
C  2.129275 -1.881966 -2.154813
H  2.046562 2.913905 -1.088379
H  1.861204 1.225436 -1.525758
H  2.488818 2.64963 -3.458719
H  1.047889 3.613058 -3.264092
H  -0.158009 4.371057 -1.124756
H  -2.470978 4.337127 -0.164291
H  1.063401 0.614944 -3.918596
H  -0.38189 1.600873 -3.775352
H  0.763675 1.91007 -5.071651
H  1.144373 -0.62882 3.373099
H  5.454815 -0.712828 -0.199615
H  4.783796 1.052781 3.895555
H  6.461656 0.474709 4.005024
H  5.108289 -0.642149 4.290835
H  2.372293 -2.054919 -3.199545
H  1.334326 -1.137765 -2.087902
H  1.775003 -2.813762 -1.712443
H  0.438706 -1.585428 0.143298
totalener: -2238.46851661 hartree
nucrepener: 3581.13225822 hartree
electener: -5819.60077483 hartree
twoeener: 4373.57697167 hartree
kineticenergy: 2231.49022107 hartree
xcener: -168.721849612231 hartree
chargesum: 0.0000000
charge: 0.007667 0.852998 -0.455965 -0.407977 -0.350255 -0.263098 -0.265416 0.185867 -0.270121 -0.261690 -0.222373 -0.165809 -0.402102 -0.405077 -0.197570 0.072866 -0.136109 0.174266 -0.104848 -0.080339 -0.152708 0.177142 -0.247604 0.319785 0.351237 0.386034 0.371505 -0.298954 -0.124885 -0.114836 0.104147 0.067776 0.077239 0.063257 0.132886 0.144527 0.075914 0.089888 0.094182 0.168309 0.129165 0.107134 0.124212 0.110340 0.131987 0.074297 0.126976 0.206132
qa: 0.0077 0.8530 -0.4560 -0.4080 -0.3503 -0.2631 -0.2654 0.1859 -0.2701 -0.2617 -0.2224 -0.1658 -0.4021 -0.4051 -0.1976 0.0729 -0.1361 0.1743 -0.1048 -0.0803 -0.1527 0.1771 -0.2476 0.3198 0.3512 0.3860 0.3715 -0.2990 -0.1249 -0.1148 0.1041 0.0678 0.0772 0.0633 0.1329 0.1445 0.0759 0.0899 0.0942 0.1683 0.1292 0.1071 0.1242 0.1103 0.1320 0.0743 0.1270 0.2061
va: 1.3274 5.9052 2.0289 2.1041 2.1616 2.1514 2.1369 3.4389 2.8819 3.1364 3.0790 3.1562 2.9734 2.9468 3.8635 3.9556 3.9384 4.0514 3.8788 3.8782 4.0829 4.1949 3.9355 4.4147 4.2565 4.0599 4.0080 3.9449 3.8746 3.8580 1.0096 1.0232 1.0109 1.0097 1.0004 1.0085 1.0047 1.0050 1.0053 1.0347 1.0222 0.9970 0.9939 0.9969 0.9943 0.9939 0.9984 1.0711
dispcorr: -0.029927167 hartree
energy: -2238.498443780379
dipole: 38.62957 -35.43080 3.19877 15.11704 -12.93632 2.18072 -18.98599 18.38606 -0.59992
magnitude: 3.91760 au
magnitude: 9.95775 debye
