program: Gaussian 09
title: 000002097
version: EM64L-G09RevD.01
frameworkgroup: C1[X(C13H17NO2)]
method: RPBEPBE
basis: SDD
operation: Freq
keyword: #p
keyword: freq=noraman
keyword: PBEPBE/SDD
title: #p freq=noraman PBEPBE/SDD
converged: YES YES NO NO
title: Mulliken charges:
elementType: O O N C C C C C C C C C C C C C H H H H H H H H H H H H H H H H H
charge: -0.410423 -0.245142 -0.428750 -0.327220 0.511598 0.465336 -0.439082 -0.391489 -0.697104 -0.426463 -0.375040 -0.482253 0.179495 0.484410 -0.791457 -0.720185 0.243593 0.228530 0.252874 0.228000 0.240154 0.218212 0.216162 0.228924 0.290131 0.225359 0.207353 0.235200 0.227067 0.227450 0.227181 0.225857 0.371720
chargesum: 0.00000
title: Mulliken charges with hydrogens summed into heavy atoms:
elementType: O O N C C C C C C C C C C C C C
charge: -0.038703 -0.245142 -0.138618 -0.083626 0.511598 0.465336 -0.210552 -0.138615 -0.010738 -0.210301 -0.146116 -0.049541 0.179495 0.484410 -0.101740 -0.267147
polarizability: 2.39305856e+02 9.58980083e+00 1.14283251e+02 2.82800173e+00 -2.97114657e+00 1.33403325e+02
1716.lowfreq: -14.5198 -7.7731 -5.2956 -0.0006 -0.0005 -0.0005 22.6144 25.7762 41.0310
frequency: 22.3478 25.5268 41.0142 46.8306 68.7608 77.1076 124.9459 131.4924 153.1469 206.1465 214.0957 216.9734 232.8685 295.7460 361.7266 367.7421 390.5189 409.9092 411.9530 430.3816 468.3690 517.9522 527.8013 555.7311 601.1009 621.0049 636.8898 693.1955 714.5503 728.2459 774.1940 807.1373 813.2425 819.4546 828.0418 846.1451 937.6254 953.5509 958.0314 959.8379 976.8228 987.8669 1001.9473 1030.1962 1032.1122 1055.1255 1068.8647 1086.5519 1099.8069 1134.2393 1190.5758 1201.4013 1218.1777 1235.0887 1272.6597 1277.6728 1293.8601 1327.9517 1344.7738 1345.5127 1381.0607 1388.9108 1390.5981 1423.0317 1430.9062 1455.3996 1467.7362 1472.0201 1473.3970 1475.2973 1485.1802 1520.1877 1580.6490 1631.8991 1655.6485 1674.5798 2927.6025 2971.2396 2990.1641 2990.6312 3041.3549 3047.6136 3087.3676 3090.1314 3092.9650 3105.1578 3108.3550 3128.0205 3133.9986 3155.7843 3193.7671 3502.9209 3551.1860
redmass: 4.2208 3.3865 4.9461 3.9730 5.0275 3.2435 2.2736 4.8522 1.3188 2.9181 1.4294 2.3019 3.2204 5.1547 3.5409 3.6939 2.4811 2.9197 2.8875 1.3277 3.1608 2.6703 2.3779 2.6866 2.9425 1.6810 5.8154 2.2465 1.4059 3.2519 3.5315 1.8187 1.6764 2.9550 2.2569 3.3173 1.3799 1.3450 1.3428 1.3290 1.7236 2.4279 2.4746 2.0802 1.6667 1.6441 1.6881 2.6197 3.1176 1.4619 1.2663 1.5486 1.2019 1.6312 1.5760 1.6374 2.5316 1.4678 2.0012 1.6073 2.6603 1.2093 1.2366 3.3657 1.1829 1.0532 1.0639 1.4713 1.0710 1.0901 1.1269 3.0020 5.1436 6.4338 8.0076 5.0361 1.0628 1.0382 1.0967 1.0354 1.0849 1.0953 1.0997 1.0638 1.0988 1.1001 1.0870 1.0883 1.0962 1.0948 1.1141 1.0638 1.0766
irintensity: 0.1620 0.1271 2.1660 0.7547 0.4317 0.7257 0.5235 0.3757 0.7497 0.7638 0.2806 1.9949 1.1630 1.4252 9.5531 1.1306 4.1814 0.8950 3.8831 141.0487 10.6816 5.5827 35.0227 44.8878 36.1803 97.9715 4.5913 36.7590 8.0671 1.2046 14.0677 11.9253 4.8223 25.3447 29.1230 1.5316 0.2432 9.4832 27.1807 40.9573 1.9524 5.6991 6.6936 255.4661 42.3187 6.1899 35.2809 29.4450 20.7526 24.1319 28.0848 4.0776 26.6089 0.4590 9.6002 45.0821 28.6503 24.5959 23.8427 22.8823 62.8784 24.1607 27.7202 11.2876 6.6247 13.8702 9.0173 10.0932 77.0712 8.3151 3.3694 256.6738 3.0760 198.6323 198.5568 26.0351 67.1189 17.8649 30.7082 34.7791 8.2287 20.2696 43.8693 11.7901 29.4829 17.0853 18.2968 10.2291 26.2627 15.0485 24.0574 18.7780 35.8942
temp: 298.150 k
press: 1.00000 atm
elementType: 8 8 7 6 6 6 6 6 6 6 6 6 6 6 6 6 1 1 1 1 1 1 1 1 1 1 1 1 1 1 1 1 1
symmnumber: 1
zpe: 712958.2 jmol-1
zpe.correction: 0.271551 hartree
zpe.thermalcorrener: 0.288661 hartree
zpe.thermalcorrenthalpy: 0.289606 hartree
zpe.thermalcorrgfe: 0.224244 hartree
zpe.sumelectzpe: -709.575704 hartree
zpe.sumelectthermal: -709.558594 hartree
zpe.sumelectthermalent: -709.557649 hartree
zpe.sumelectthermalfe: -709.623012 hartree
dipole: -2.6342 -0.4669 1.4453
dipole: 3.0407
quadrupole: -86.4877 -92.8186 -96.4474
quadrupole: -0.7865 3.9452 0.7315
quadrupole: 5.4302 -0.9007 -4.5295 -0.7865 3.9452 0.7315
hfenergy: -709.8472551 hartree
pointgroup: C01 [X(C13H17N1O2)]
dipole: 1.0293429 0.3717313 0.483133 debye
polarizability: 239.474657|7.7662041|118.6106512|-4.3329793|8.6648329|128.9071237 unknown
InChI: InChI=1S/C13H17NO2/c1-9(2)8-14-12-6-4-11(5-7-12)10(3)13(15)16/h4-7,10,14-15H,1,8H2,2-3H3
charge 0 multiplicity 1
33 atoms
O  -4.277451 -1.089142 1.387943
O  -3.993539 -1.663137 -0.841858
N  2.471718 0.505882 0.222582
C  -3.328942 0.603615 -0.064418
C  -1.795451 0.548353 0.012833
C  1.07593 0.514159 0.127285
C  -1.093836 1.306756 0.984019
C  -1.036678 -0.2291 -0.897083
C  -3.830448 1.251463 -1.380403
C  0.311253 1.296309 1.044618
C  0.371481 -0.248424 -0.851726
C  3.362288 -0.204421 -0.706495
C  -3.888425 -0.809872 0.068241
C  4.757289 -0.36747 -0.109374
C  4.859859 -1.23698 1.130204
C  5.833326 0.228781 -0.686879
H  -3.698241 1.181608 0.80042
H  -1.655176 1.911932 1.706698
H  -1.553196 -0.834737 -1.651603
H  -3.401619 2.262928 -1.484728
H  -3.522795 0.648129 -2.251084
H  -4.932836 1.331157 -1.392618
H  0.828362 1.888195 1.810822
H  0.918544 -0.849074 -1.584973
H  2.906416 1.222774 0.804769
H  3.428826 0.31184 -1.689618
H  2.935324 -1.21074 -0.895054
H  4.156823 -0.898116 1.913906
H  4.5830 -2.283638 0.894511
H  5.881186 -1.23662 1.546653
H  5.733589 0.846692 -1.587468
H  6.8440 0.110601 -0.279394
H  -4.584481 -2.035502 1.441673
