program: Orca
programVersion: 4.2.1
elementType: Cl S O O O O O N N N N N N N C C C C C C C C C C C C C C C C H H H H H H H H H H H H H H H H H H
charge: 0
multiplicity: 1
keywords: wb97x-d3
keywords: def2-TZVPP
keywords: def2/J RIJCOSX GRIDX6 NOFINALGRIDX
keywords: grid4 nofinalgrid
keywords: scfconv7
keywords: smallprint printgap noloewdin
keywords: NOSOSCF
formula: C16H18ClN7O5S
InChI: InChI=1S/C16H18ClN7O5S/c1-4-5-9-6-7-10-18-13(17)14(24(10)22-9)30(26,27)23-16(25)21-15-19-11(28-2)8-12(20-15)29-3/h6-8,21,23H,4-5H2,1-3H3
48 atoms
Cl -5.041947 -0.433232 0.93182
S  -1.581966 -0.846834 1.773971
O  -2.557164 -1.807634 2.201847
O  -0.80446 -0.072397 2.714366
O  -1.777958 -2.465134 -0.769048
O  4.659338 -2.317996 -2.874472
O  3.759495 -0.278949 1.20224
N  -1.709534 1.14574 -0.09964
N  -0.39488 1.313754 -0.146898
N  -3.869744 1.382103 -0.579456
N  -0.414625 -1.555452 0.818229
N  0.450328 -2.455925 -1.140747
N  2.552733 -2.397045 -2.006417
N  2.110581 -1.374585 0.0721
C  -2.382308 0.230418 0.661668
C  0.036378 2.220381 -0.977518
C  1.518056 2.426033 -1.056008
C  -2.652178 1.81921 -0.839446
C  1.968465 3.764046 -0.46314
C  -0.838114 3.002254 -1.784075
C  -2.182083 2.805824 -1.719927
C  -3.712442 0.413104 0.321535
C  1.709194 3.875439 1.031121
C  -0.679667 -2.176217 -0.375141
C  1.757584 -2.055556 -1.006102
C  3.814538 -2.007659 -1.907794
C  3.376344 -0.981082 0.152344
C  4.305567 -1.274415 -0.831819
C  4.177521 -3.064275 -3.981165
C  2.80735 -0.003383 2.22453
H  2.014229 1.604785 -0.537469
H  1.824719 2.370927 -2.10423
H  1.476332 4.58745 -0.988842
H  3.036218 3.879631 -0.661136
H  -0.416784 3.741404 -2.451362
H  -2.889292 3.36229 -2.31788
H  2.065064 4.829547 1.418621
H  0.648466 3.799097 1.271156
H  2.224084 3.085193 1.579333
H  0.247439 -2.947589 -1.998146
H  5.336192 -0.961485 -0.767326
H  3.795997 -4.039045 -3.676595
H  5.032544 -3.198377 -4.638187
H  3.388306 -2.533611 -4.514389
H  1.962265 0.579363 1.854751
H  3.342142 0.574171 2.973403
H  2.428823 -0.917693 2.683145
H  0.547803 -1.236914 0.972641
totalener: -2238.46858003 hartree
nucrepener: 3584.35097948 hartree
electener: -5822.81955951 hartree
twoeener: 4376.75523105 hartree
kineticenergy: 2231.48649775 hartree
xcener: -168.721103344364 hartree
chargesum: -0.0000000
charge: 0.006980 0.852259 -0.407932 -0.456931 -0.349436 -0.262971 -0.264336 0.186989 -0.271256 -0.261520 -0.218707 -0.164317 -0.401275 -0.403834 -0.189343 0.068737 -0.128482 0.172395 -0.099126 -0.082923 -0.150269 0.171072 -0.251448 0.316354 0.349584 0.386124 0.363124 -0.293637 -0.125038 -0.120360 0.066999 0.104503 0.061558 0.076401 0.131815 0.144453 0.094010 0.091909 0.074814 0.168240 0.128981 0.110219 0.124667 0.106577 0.081161 0.132143 0.126766 0.204307
qa: 0.0070 0.8523 -0.4079 -0.4569 -0.3494 -0.2630 -0.2643 0.1870 -0.2713 -0.2615 -0.2187 -0.1643 -0.4013 -0.4038 -0.1893 0.0687 -0.1285 0.1724 -0.0991 -0.0829 -0.1503 0.1711 -0.2514 0.3164 0.3496 0.3861 0.3631 -0.2936 -0.1250 -0.1204 0.0670 0.1045 0.0616 0.0764 0.1318 0.1445 0.0940 0.0919 0.0748 0.1682 0.1290 0.1102 0.1247 0.1066 0.0812 0.1321 0.1268 0.2043
va: 1.3267 5.9034 2.1030 2.0273 2.1621 2.1512 2.1362 3.4330 2.8775 3.1367 3.0783 3.1549 2.9729 2.9409 3.8624 3.9620 3.9340 4.0557 3.8786 3.8837 4.0843 4.2011 3.9379 4.4182 4.2566 4.0584 4.0134 3.9391 3.8747 3.8573 1.0234 1.0084 1.0098 1.0106 1.0007 1.0086 1.0064 1.0045 1.0028 1.0348 1.0223 0.9968 0.9937 0.9971 0.9937 0.9943 0.9984 1.0736
dispcorr: -0.030064590 hartree
energy: -2238.498644622968
dipole: 40.76080 -37.80647 2.95434 18.91697 -17.38788 1.52909 -10.65267 8.53148 -2.12120
magnitude: 3.94534 au
magnitude: 10.02825 debye
