program: Orca
programVersion: 4.2.1
elementType: Cl S O O O O O N N N N N N N C C C C C C C C C C C C C C C C H H H H H H H H H H H H H H H H H H
charge: 0
multiplicity: 1
keywords: wb97x-d3
keywords: def2-TZVPP
keywords: def2/J RIJCOSX GRIDX6 NOFINALGRIDX
keywords: grid4 nofinalgrid
keywords: scfconv7
keywords: smallprint printgap noloewdin
keywords: NOSOSCF
formula: C16H18ClN7O5S
InChI: InChI=1S/C16H18ClN7O5S/c1-4-5-9-6-7-10-18-13(17)14(24(10)22-9)30(26,27)23-16(25)21-15-19-11(28-2)8-12(20-15)29-3/h6-8,21,23H,4-5H2,1-3H3
48 atoms
Cl -5.139646 -0.549603 0.566238
S  -1.766617 -0.739832 1.762225
O  -2.69738 -1.806178 1.997761
O  -1.119625 -0.035093 2.844681
O  -1.661697 -2.067318 -0.945379
O  5.006729 -2.054294 -2.187509
O  3.637897 -0.174234 1.8353
N  -1.917157 1.482576 0.173251
N  -0.633076 1.784684 0.310327
N  -4.029186 1.578291 -0.523017
N  -0.48521 -1.258583 0.83278
N  0.594071 -2.044535 -1.066438
N  2.797068 -2.056831 -1.626957
N  2.113462 -1.11297 0.424052
C  -2.558859 0.403663 0.716027
C  -0.229411 2.856021 -0.311588
C  1.220506 3.214635 -0.190125
C  -2.849066 2.16649 -0.570389
C  1.967218 3.142958 -1.525052
C  -1.101598 3.667549 -1.091403
C  -2.410418 3.326265 -1.22714
C  -3.858435 0.504476 0.246933
C  2.050848 1.7349 -2.093202
C  -0.61436 -1.807625 -0.415109
C  1.885507 -1.721868 -0.728931
C  4.049274 -1.742332 -1.332912
C  3.372656 -0.795953 0.701996
C  4.416612 -1.088269 -0.160594
C  4.652326 -2.730697 -3.383748
C  2.564386 0.116338 2.723298
H  1.298243 4.227154 0.215675
H  1.688017 2.54583 0.534011
H  2.974758 3.535763 -1.373526
H  1.494807 3.810632 -2.250978
H  -0.708267 4.553168 -1.571046
H  -3.113795 3.903239 -1.809905
H  2.602932 1.078213 -1.421192
H  1.06481 1.295457 -2.250124
H  2.567808 1.730876 -3.05196
H  0.489857 -2.482097 -1.969613
H  5.441634 -0.837001 0.064264
H  5.585058 -2.886978 -3.918945
H  3.974473 -2.137794 -3.998211
H  4.184044 -3.693869 -3.18014
H  3.012421 0.642764 3.5613
H  2.082247 -0.791076 3.088714
H  1.807326 0.751939 2.26142
H  0.452192 -0.966186 1.127439
totalener: -2238.46933092 hartree
nucrepener: 3589.88013480 hartree
electener: -5828.34946573 hartree
twoeener: 4382.35919607 hartree
kineticenergy: 2231.48634381 hartree
xcener: -168.722340632308 hartree
chargesum: -0.0000000
charge: 0.007461 0.851723 -0.410499 -0.455647 -0.355302 -0.262039 -0.261417 0.188802 -0.276193 -0.261512 -0.219342 -0.158004 -0.395776 -0.396395 -0.198684 0.081019 -0.152094 0.174641 -0.111928 -0.080439 -0.150255 0.176707 -0.220971 0.325219 0.322033 0.380847 0.368660 -0.285519 -0.127167 -0.117183 0.108128 0.095456 0.078266 0.064353 0.129667 0.144192 0.040584 0.082519 0.096665 0.168080 0.128702 0.125045 0.107061 0.110645 0.128341 0.119911 0.088135 0.203504
qa: 0.0075 0.8517 -0.4105 -0.4556 -0.3553 -0.2620 -0.2614 0.1888 -0.2762 -0.2615 -0.2193 -0.1580 -0.3958 -0.3964 -0.1987 0.0810 -0.1521 0.1746 -0.1119 -0.0804 -0.1503 0.1767 -0.2210 0.3252 0.3220 0.3808 0.3687 -0.2855 -0.1272 -0.1172 0.1081 0.0955 0.0783 0.0644 0.1297 0.1442 0.0406 0.0825 0.0967 0.1681 0.1287 0.1250 0.1071 0.1106 0.1283 0.1199 0.0881 0.2035
va: 1.3270 5.9053 2.1015 2.0294 2.1588 2.1533 2.1532 3.4357 2.8974 3.1373 3.0745 3.1635 2.9454 2.9399 3.8661 3.9477 3.9162 4.0523 3.8899 3.8822 4.0783 4.1970 3.9321 4.4098 4.2550 4.0528 4.0274 3.9026 3.8766 3.8654 1.0051 1.0113 1.0102 1.0106 1.0026 1.0090 1.0245 1.0054 1.0084 1.0355 1.0225 0.9938 0.9965 0.9968 0.9960 0.9980 0.9927 1.0710
dispcorr: -0.030724066 hartree
energy: -2238.500054987766
dipole: 42.36062 -39.33125 3.02938 14.56085 -12.78307 1.77778 -15.47511 13.80401 -1.67110
magnitude: 3.88975 au
magnitude: 9.88697 debye
