program: Orca
programVersion: 4.2.1
elementType: Cl S O O O O O N N N N N N N C C C C C C C C C C C C C C C C H H H H H H H H H H H H H H H H H H
charge: 0
multiplicity: 1
keywords: wb97x-d3
keywords: def2-TZVPP
keywords: def2/J RIJCOSX GRIDX6 NOFINALGRIDX
keywords: grid4 nofinalgrid
keywords: scfconv7
keywords: smallprint printgap noloewdin
keywords: NOSOSCF
formula: C16H18ClN7O5S
InChI: InChI=1S/C16H18ClN7O5S/c1-4-5-9-6-7-10-18-13(17)14(24(10)22-9)30(26,27)23-16(25)21-15-19-11(28-2)8-12(20-15)29-3/h6-8,21,23H,4-5H2,1-3H3
48 atoms
Cl -5.006025 -0.299221 1.446517
S  -2.068227 -1.592164 -0.146883
O  -1.834858 -1.901647 -1.538686
O  -2.881312 -2.424793 0.692247
O  -1.061388 -0.680214 2.548911
O  2.97449 -1.697739 -2.146596
O  5.623254 -0.378705 1.435469
N  -2.066833 1.11295 -0.562039
N  -0.910009 1.109336 -1.210334
N  -3.91813 1.869148 0.415256
N  -0.527028 -1.446339 0.468022
N  1.118355 -0.779713 1.963574
N  2.034682 -1.270828 -0.113842
N  3.369307 -0.586437 1.707007
C  -2.690532 0.028248 -0.010384
C  -0.491015 2.266725 -1.637556
C  0.823232 2.296931 -2.35729
C  -2.847992 2.207931 -0.27817
C  1.888864 3.114075 -1.621769
C  -1.221539 3.471809 -1.434521
C  -2.397667 3.449172 -0.753007
C  -3.824137 0.55157 0.589564
C  2.274939 2.526595 -0.273322
C  -0.241113 -0.956131 1.714505
C  2.21283 -0.891155 1.141894
C  3.113723 -1.337063 -0.885002
C  4.437853 -0.665324 0.928868
C  4.379985 -1.032991 -0.412186
C  1.677322 -2.040705 -2.621723
C  5.704557 -0.014255 2.804568
H  1.170579 1.271938 -2.496481
H  0.667831 2.717895 -3.354866
H  1.54482 4.144287 -1.494152
H  2.772477 3.174649 -2.260654
H  -0.827637 4.399166 -1.826997
H  -2.989118 4.333897 -0.566612
H  2.705408 1.532442 -0.392533
H  3.019048 3.147052 0.225117
H  1.418773 2.439294 0.39704
H  1.322613 -0.457341 2.897552
H  5.259775 -1.090948 -1.034253
H  1.809174 -2.300689 -3.668217
H  0.974965 -1.209293 -2.543442
H  1.263769 -2.898859 -2.090596
H  5.135205 0.890915 3.017415
H  6.758662 0.166183 2.997175
H  5.346936 -0.811197 3.45702
H  0.247217 -1.515449 -0.20066
totalener: -2238.46926761 hartree
nucrepener: 3594.34799229 hartree
electener: -5832.81725991 hartree
twoeener: 4386.80315143 hartree
kineticenergy: 2231.48436162 hartree
xcener: -168.722158333727 hartree
chargesum: -0.0000000
charge: 0.007385 0.851914 -0.455962 -0.410572 -0.354173 -0.262238 -0.261783 0.189192 -0.275413 -0.260745 -0.219724 -0.156771 -0.395289 -0.397204 -0.196009 0.080829 -0.149373 0.174301 -0.112839 -0.083984 -0.148219 0.173925 -0.213576 0.323373 0.321682 0.368465 0.380001 -0.283305 -0.117093 -0.126736 0.092181 0.108422 0.064528 0.078473 0.128692 0.144369 0.032171 0.096888 0.082991 0.168075 0.128500 0.128727 0.090176 0.118330 0.107050 0.124888 0.110519 0.204961
qa: 0.0074 0.8519 -0.4560 -0.4106 -0.3542 -0.2622 -0.2618 0.1892 -0.2754 -0.2607 -0.2197 -0.1568 -0.3953 -0.3972 -0.1960 0.0808 -0.1494 0.1743 -0.1128 -0.0840 -0.1482 0.1739 -0.2136 0.3234 0.3217 0.3685 0.3800 -0.2833 -0.1171 -0.1267 0.0922 0.1084 0.0645 0.0785 0.1287 0.1444 0.0322 0.0969 0.0830 0.1681 0.1285 0.1287 0.0902 0.1183 0.1071 0.1249 0.1105 0.2050
va: 1.3271 5.9051 2.0288 2.1014 2.1595 2.1526 2.1541 3.4359 2.8990 3.1370 3.0748 3.1637 2.9419 2.9444 3.8640 3.9484 3.9172 4.0530 3.8907 3.8843 4.0765 4.1996 3.9305 4.4116 4.2556 4.0273 4.0535 3.9017 3.8646 3.8769 1.0138 1.0053 1.0107 1.0105 1.0033 1.0088 1.0286 1.0084 1.0060 1.0355 1.0226 0.9958 0.9933 0.9977 0.9964 0.9938 0.9970 1.0703
dispcorr: -0.030924072 hartree
energy: -2238.500191685747
dipole: 42.76473 -39.64616 3.11857 17.20031 -15.05924 2.14107 -11.30372 10.35122 -0.95250
magnitude: 3.90089 au
magnitude: 9.91527 debye
