program: Orca
programVersion: 4.2.1
elementType: Cl S O O O O O N N N N N N N C C C C C C C C C C C C C C C C H H H H H H H H H H H H H H H H H H
charge: 0
multiplicity: 1
keywords: wb97x-d3
keywords: def2-TZVPP
keywords: def2/J RIJCOSX GRIDX6 NOFINALGRIDX
keywords: grid4 nofinalgrid
keywords: scfconv7
keywords: smallprint printgap noloewdin
keywords: NOSOSCF
formula: C16H18ClN7O5S
InChI: InChI=1S/C16H18ClN7O5S/c1-4-5-9-6-7-10-18-13(17)14(24(10)22-9)30(26,27)23-16(25)21-15-19-11(28-2)8-12(20-15)29-3/h6-8,21,23H,4-5H2,1-3H3
48 atoms
Cl -4.976778 -0.495359 1.372745
S  -1.928738 -1.423643 -0.259325
O  -1.619225 -1.571216 -1.66303
O  -2.725101 -2.387977 0.445312
O  -1.084178 -0.654621 2.531467
O  3.303862 -1.801839 -1.830326
O  5.661689 -0.368198 1.905378
N  -2.08966 1.307758 -0.383017
N  -0.923062 1.446922 -0.995178
N  -4.005094 1.834611 0.618196
N  -0.422811 -1.267193 0.439492
N  1.12821 -0.742116 2.087884
N  2.20098 -1.288148 0.099975
N  3.392248 -0.562539 2.002775
C  -2.654239 0.131225 0.026106
C  -0.564792 2.665742 -1.274555
C  0.759381 2.86585 -1.952324
C  -2.942962 2.313541 -0.001422
C  1.556937 1.598013 -2.21257
C  -1.36994 3.796684 -0.95339
C  -2.557536 3.626889 -0.315446
C  -3.831837 0.514014 0.647795
C  2.910086 1.892804 -2.84213
C  -0.211654 -0.88484 1.73618
C  2.282213 -0.875626 1.355283
C  3.340446 -1.393735 -0.575326
C  4.519115 -0.670168 1.315858
C  4.567061 -1.087588 -0.010552
C  2.056769 -2.202985 -2.385707
C  5.632906 0.067561 3.255538
H  0.58483 3.396574 -2.894716
H  1.350706 3.555605 -1.339799
H  0.979598 0.933253 -2.858488
H  1.69545 1.058685 -1.274119
H  -1.016581 4.783751 -1.218735
H  -3.203222 4.448436 -0.040847
H  2.806042 2.39845 -3.803493
H  3.519427 2.529956 -2.199033
H  3.469327 0.973212 -3.012929
H  1.265955 -0.439976 3.040654
H  5.493745 -1.174222 -0.556422
H  1.612716 -3.028491 -1.828004
H  2.279801 -2.534051 -3.396059
H  1.341332 -1.381367 -2.428887
H  5.05068 0.981919 3.372589
H  6.668367 0.259872 3.52309
H  5.220981 -0.693769 3.91818
H  0.39069 -1.365379 -0.17445
totalener: -2238.46908177 hartree
nucrepener: 3562.27150379 hartree
electener: -5800.74058556 hartree
twoeener: 4354.96322204 hartree
kineticenergy: 2231.48459117 hartree
xcener: -168.723142698451 hartree
chargesum: -0.0000000
charge: 0.005958 0.851445 -0.457547 -0.412852 -0.360104 -0.267473 -0.262487 0.172530 -0.263469 -0.262916 -0.215146 -0.165519 -0.423924 -0.402934 -0.204181 0.111185 -0.140779 0.173580 -0.056498 -0.102330 -0.144961 0.181741 -0.262155 0.331824 0.361501 0.377736 0.389659 -0.299288 -0.131513 -0.126040 0.089355 0.081728 0.078924 0.034334 0.134213 0.143751 0.083772 0.076068 0.089228 0.168200 0.128666 0.125671 0.131417 0.098068 0.107128 0.124607 0.110508 0.199320
qa: 0.0060 0.8514 -0.4575 -0.4129 -0.3601 -0.2675 -0.2625 0.1725 -0.2635 -0.2629 -0.2151 -0.1655 -0.4239 -0.4029 -0.2042 0.1112 -0.1408 0.1736 -0.0565 -0.1023 -0.1450 0.1817 -0.2622 0.3318 0.3615 0.3777 0.3897 -0.2993 -0.1315 -0.1260 0.0894 0.0817 0.0789 0.0343 0.1342 0.1438 0.0838 0.0761 0.0892 0.1682 0.1287 0.1257 0.1314 0.0981 0.1071 0.1246 0.1105 0.1993
va: 1.3257 5.8987 2.0260 2.0983 2.1543 2.1324 2.1516 3.4568 2.8852 3.1368 3.0768 3.1559 2.9346 2.9750 3.8675 3.9705 3.9481 4.0526 3.8830 3.9125 4.0707 4.1940 3.9370 4.4064 4.2378 4.0013 4.0560 3.9421 3.8602 3.8752 1.0029 1.0028 1.0047 1.0190 1.0001 1.0082 1.0039 1.0022 1.0125 1.0352 1.0221 0.9963 0.9958 0.9887 0.9972 0.9936 0.9966 1.0682
dispcorr: -0.029554242 hartree
energy: -2238.498636015350
dipole: 43.50445 -40.49087 3.01358 14.34427 -12.21770 2.12657 -15.97480 15.36298 -0.61182
magnitude: 3.73875 au
magnitude: 9.50315 debye
