program: Orca
programVersion: 4.2.1
elementType: Cl S O O O O O N N N N N N N C C C C C C C C C C C C C C C C H H H H H H H H H H H H H H H H H H
charge: 0
multiplicity: 1
keywords: wb97x-d3
keywords: def2-TZVPP
keywords: def2/J RIJCOSX GRIDX6 NOFINALGRIDX
keywords: grid4 nofinalgrid
keywords: scfconv7
keywords: smallprint printgap noloewdin
keywords: NOSOSCF
formula: C16H18ClN7O5S
InChI: InChI=1S/C16H18ClN7O5S/c1-4-5-9-6-7-10-18-13(17)14(24(10)22-9)30(26,27)23-16(25)21-15-19-11(28-2)8-12(20-15)29-3/h6-8,21,23H,4-5H2,1-3H3
48 atoms
Cl -5.048663 -0.28014 1.150214
S  -1.998471 -1.585086 -0.225785
O  -1.648712 -1.768837 -1.615684
O  -2.919297 -2.453458 0.448722
O  -1.223287 -1.029346 2.63648
O  3.165768 -1.260997 -1.839175
O  5.479185 -0.245493 2.060113
N  -1.833057 1.138836 -0.365379
N  -0.608295 1.126346 -0.867291
N  -3.750263 1.9095 0.46011
N  -0.515643 -1.572517 0.536465
N  0.995643 -1.023287 2.214102
N  2.073781 -1.181009 0.161657
N  3.236027 -0.643221 2.14243
C  -2.564358 0.046548 0.008857
C  -0.081267 2.28999 -1.125955
C  1.294438 2.276379 -1.717151
C  -2.590399 2.248341 -0.071707
C  1.269841 2.206749 -3.245173
C  -0.770676 3.512167 -0.897124
C  -2.023972 3.497556 -0.36629
C  -3.736878 0.578643 0.520439
C  2.67085 2.123728 -3.831259
C  -0.336094 -1.201323 1.844266
C  2.143771 -0.952254 1.463543
C  3.200191 -1.068709 -0.53277
C  4.353766 -0.548318 1.439117
C  4.408043 -0.745585 0.062495
C  1.928441 -1.621188 -2.44511
C  5.443824 -0.039425 3.463908
H  1.839973 3.167902 -1.396833
H  1.837712 1.41614 -1.32321
H  0.74588 3.078821 -3.645922
H  0.685715 1.334855 -3.549804
H  -0.280852 4.444838 -1.140142
H  -2.587095 4.396224 -0.159927
H  3.267039 2.9986 -3.567153
H  3.199255 1.242794 -3.463352
H  2.641164 2.062923 -4.918687
H  1.117538 -0.800087 3.190597
H  5.325519 -0.658376 -0.498715
H  1.562007 -2.580237 -2.076983
H  2.137497 -1.704789 -3.507871
H  1.156381 -0.867114 -2.286183
H  6.465857 0.191757 3.751545
H  5.108675 -0.930443 3.995164
H  4.792531 0.792028 3.734539
H  0.307207 -1.541386 -0.074394
totalener: -2238.46930754 hartree
nucrepener: 3574.40435588 hartree
electener: -5812.87366342 hartree
twoeener: 4366.75883515 hartree
kineticenergy: 2231.48468026 hartree
xcener: -168.719899153016 hartree
chargesum: 0.0000000
charge: 0.008256 0.852860 -0.456097 -0.407557 -0.349586 -0.272300 -0.262800 0.191746 -0.296623 -0.262361 -0.222436 -0.166354 -0.405931 -0.401622 -0.192256 0.133275 -0.143835 0.166739 -0.119285 -0.105178 -0.137077 0.168889 -0.251872 0.321549 0.352948 0.370402 0.386170 -0.296664 -0.131156 -0.124953 0.092022 0.073165 0.078091 0.083947 0.132054 0.144876 0.077815 0.077208 0.092185 0.168194 0.129109 0.132717 0.132865 0.090393 0.124303 0.110321 0.107315 0.206530
qa: 0.0083 0.8529 -0.4561 -0.4076 -0.3496 -0.2723 -0.2628 0.1917 -0.2966 -0.2624 -0.2224 -0.1664 -0.4059 -0.4016 -0.1923 0.1333 -0.1438 0.1667 -0.1193 -0.1052 -0.1371 0.1689 -0.2519 0.3215 0.3529 0.3704 0.3862 -0.2967 -0.1312 -0.1250 0.0920 0.0732 0.0781 0.0839 0.1321 0.1449 0.0778 0.0772 0.0922 0.1682 0.1291 0.1327 0.1329 0.0904 0.1243 0.1103 0.1073 0.2065
va: 1.3281 5.9054 2.0288 2.1042 2.1625 2.1199 2.1515 3.4348 2.9124 3.1367 3.0797 3.1568 2.9505 2.9747 3.8623 3.9423 3.9009 4.0604 3.8575 3.9188 4.0630 4.2014 3.9372 4.4142 4.2540 3.9952 4.0589 3.9466 3.8489 3.8745 1.0156 1.0229 1.0097 1.0086 1.0018 1.0080 1.0030 1.0095 1.0060 1.0348 1.0217 1.0009 0.9939 0.9929 0.9939 0.9968 0.9971 1.0702
dispcorr: -0.030052217 hartree
energy: -2238.499359755281
dipole: 43.35112 -40.14374 3.20738 15.53625 -13.37119 2.16506 -18.69101 18.10406 -0.58694
magnitude: 3.91399 au
magnitude: 9.94856 debye
