program: Orca
programVersion: 4.2.1
elementType: Cl S O O O O O N N N N N N N C C C C C C C C C C C C C C C C H H H H H H H H H H H H H H H H H H
charge: 0
multiplicity: 1
keywords: wb97x-d3
keywords: def2-TZVPP
keywords: def2/J RIJCOSX GRIDX6 NOFINALGRIDX
keywords: grid4 nofinalgrid
keywords: scfconv7
keywords: smallprint printgap noloewdin
keywords: NOSOSCF
formula: C16H18ClN7O5S
InChI: InChI=1S/C16H18ClN7O5S/c1-4-5-9-6-7-10-18-13(17)14(24(10)22-9)30(26,27)23-16(25)21-15-19-11(28-2)8-12(20-15)29-3/h6-8,21,23H,4-5H2,1-3H3
48 atoms
Cl -5.059724 -0.285792 1.134363
S  -1.995383 -1.593681 -0.203943
O  -1.643147 -1.78562 -1.592128
O  -2.918078 -2.456758 0.474604
O  -1.222461 -0.992513 2.647028
O  3.172008 -1.31033 -1.819263
O  5.476532 -0.195086 2.057018
N  -1.828173 1.130476 -0.349544
N  -0.598163 1.117243 -0.838052
N  -3.75629 1.902167 0.448919
N  -0.512737 -1.578277 0.559589
N  0.996799 -0.991307 2.226134
N  2.07699 -1.190051 0.178192
N  3.235169 -0.60206 2.147166
C  -2.561583 0.039004 0.022574
C  -0.070114 2.28034 -1.097345
C  1.311584 2.264722 -1.674396
C  -2.590884 2.240231 -0.071088
C  1.300024 2.185137 -3.202255
C  -0.763909 3.502478 -0.882894
C  -2.02321 3.488632 -0.366331
C  -3.741774 0.571728 0.515509
C  2.705479 2.088171 -3.775471
C  -0.334316 -1.179724 1.859194
C  2.144861 -0.931742 1.474653
C  3.203503 -1.087996 -0.517683
C  4.353014 -0.518157 1.442805
C  4.409386 -0.746599 0.07117
C  1.936588 -1.683687 -2.420449
C  5.441455 0.035026 3.456993
H  1.853336 3.158718 -1.354483
H  1.851488 1.407056 -1.270083
H  0.785606 3.058146 -3.613264
H  0.712554 1.315219 -3.506139
H  -0.273214 4.434804 -1.125408
H  -2.59004 4.387575 -0.17159
H  3.223453 1.204881 -3.398534
H  2.683956 2.021184 -4.862718
H  3.306514 2.959732 -3.511612
H  1.117792 -0.747366 3.197642
H  5.327089 -0.668561 -0.490945
H  2.148015 -1.78764 -3.480968
H  1.163477 -0.92743 -2.278077
H  1.570791 -2.635975 -2.034743
H  6.463258 0.273067 3.739924
H  5.108517 -0.847471 4.003504
H  4.78868 0.869633 3.713781
H  0.311137 -1.557766 -0.05053
totalener: -2238.46926613 hartree
nucrepener: 3576.55977044 hartree
electener: -5815.02903657 hartree
twoeener: 4368.91434761 hartree
kineticenergy: 2231.48763744 hartree
xcener: -168.720332069254 hartree
chargesum: 0.0000000
charge: 0.008066 0.853145 -0.456361 -0.407551 -0.349569 -0.271794 -0.262804 0.192560 -0.296919 -0.262438 -0.221029 -0.165706 -0.405651 -0.401415 -0.189728 0.130851 -0.140184 0.167031 -0.120944 -0.104719 -0.137424 0.166808 -0.251336 0.319984 0.352817 0.368129 0.386443 -0.295420 -0.128544 -0.125062 0.091923 0.072494 0.077899 0.084041 0.132086 0.144773 0.076912 0.092203 0.077952 0.168207 0.128956 0.132678 0.089250 0.131643 0.124275 0.110340 0.107344 0.205789
qa: 0.0081 0.8531 -0.4564 -0.4076 -0.3496 -0.2718 -0.2628 0.1926 -0.2969 -0.2624 -0.2210 -0.1657 -0.4057 -0.4014 -0.1897 0.1309 -0.1402 0.1670 -0.1209 -0.1047 -0.1374 0.1668 -0.2513 0.3200 0.3528 0.3681 0.3864 -0.2954 -0.1285 -0.1251 0.0919 0.0725 0.0779 0.0840 0.1321 0.1448 0.0769 0.0922 0.0780 0.1682 0.1290 0.1327 0.0892 0.1316 0.1243 0.1103 0.1073 0.2058
va: 1.3279 5.9043 2.0286 2.1039 2.1620 2.1211 2.1514 3.4322 2.9099 3.1367 3.0802 3.1565 2.9508 2.9744 3.8624 3.9458 3.8995 4.0599 3.8604 3.9187 4.0636 4.2038 3.9364 4.4151 4.2534 3.9963 4.0584 3.9430 3.8496 3.8747 1.0154 1.0234 1.0096 1.0083 1.0016 1.0080 1.0100 1.0061 1.0029 1.0348 1.0217 0.9941 0.9939 1.0004 0.9939 0.9969 0.9970 1.0710
dispcorr: -0.030109847 hartree
energy: -2238.499375974700
dipole: 43.52530 -40.31149 3.21381 15.44349 -13.28670 2.15679 -18.46766 17.87998 -0.58767
magnitude: 3.91480 au
magnitude: 9.95064 debye
