program: Orca
programVersion: 4.2.1
elementType: S O O O O O O O N N N N N N C C C C C C C C C C C C C C C C C H H H H H H H H H H H H H H H H H H H H
charge: 0
multiplicity: 1
keywords: wb97x-d3
keywords: def2-TZVPP
keywords: def2/J RIJCOSX GRIDX6 NOFINALGRIDX
keywords: grid4 nofinalgrid
keywords: scfconv7
keywords: smallprint printgap noloewdin
keywords: NOSOSCF
formula: C17H20N6O7S
InChI: InChI=1S/C17H20N6O7S/c1-23(2)15(25)11-6-5-10(18-9-24)7-12(11)31(27,28)22-17(26)21-16-19-13(29-3)8-14(20-16)30-4/h5-9,18,21-22H,1-4H3
51 atoms
S  -0.351315 1.591175 0.613156
O  -0.238141 2.745148 -0.255124
O  -0.032277 1.724247 2.022849
O  -2.935549 3.895538 0.64027
O  -0.191414 0.249315 -2.00848
O  -1.632973 -3.118061 1.835352
O  5.406731 -3.538714 -1.3007
O  4.054483 -1.096286 2.408461
N  0.660734 0.381629 0.092265
N  -2.930067 3.543205 -1.596859
N  -3.652533 -2.335386 1.089796
N  1.657922 -0.952767 -1.525463
N  3.525334 -2.245563 -1.41961
N  2.842407 -1.011797 0.472449
C  -1.966819 0.888232 0.430715
C  -3.008935 1.659074 -0.061584
C  -2.129636 -0.428975 0.834799
C  -3.383929 -1.019989 0.725354
C  -4.256696 1.049544 -0.15996
C  -2.914909 3.136479 -0.322551
C  -4.442359 -0.263047 0.219225
C  -2.57691 2.680003 -2.705791
C  -2.845034 4.963932 -1.871773
C  0.653881 -0.074449 -1.200997
C  2.720768 -1.418356 -0.779543
C  -2.815961 -3.267882 1.595686
C  4.557678 -2.704531 -0.725337
C  3.88463 -1.477548 1.154265
C  4.801982 -2.350214 0.596407
C  5.187078 -3.928246 -2.65488
C  3.113892 -0.195303 2.989707
H  -1.29168 -0.993997 1.209919
H  -5.101614 1.610293 -0.536209
H  -5.425097 -0.707272 0.12357
H  -4.604985 -2.64405 0.956098
H  -1.565619 2.895535 -3.054504
H  -3.266754 2.839221 -3.533744
H  -2.620529 1.632486 -2.426992
H  -3.211667 5.149073 -2.879504
H  -3.457515 5.534912 -1.179185
H  -1.815112 5.323064 -1.809088
H  1.615808 -1.296436 -2.475858
H  -3.340794 -4.213466 1.776815
H  5.648549 -2.729079 1.149387
H  5.218111 -3.07403 -3.330266
H  4.238453 -4.450362 -2.774997
H  6.000512 -4.605742 -2.899016
H  2.115094 -0.630281 3.033569
H  3.084341 0.755562 2.457361
H  3.463954 -0.018787 4.002729
H  1.432892 0.076103 0.703757
elementType: S O N C H
totalener: -1913.37269095 hartree
nucrepener: 3472.80256205 hartree
electener: -5386.17525300 hartree
oneelecener: -9529.96598285 hartree
twoeener: 4143.79072985 hartree
cpcmener: -0.07805845 hartree
kineticenergy: 1906.38047109 hartree
xcener: -159.207813436611 hartree
chargesum: -0.0000000
charge: 0.886178 -0.492072 -0.521101 -0.535426 -0.474085 -0.507805 -0.300247 -0.297632 -0.232483 -0.104704 -0.111584 -0.129990 -0.428858 -0.434493 -0.071561 0.033391 -0.132795 0.077925 -0.141280 0.326861 -0.121290 -0.159451 -0.174217 0.384784 0.380573 0.281489 0.419728 0.426763 -0.324165 -0.114687 -0.129100 0.148078 0.148895 0.148177 0.182518 0.109726 0.125189 0.109910 0.109266 0.105662 0.117457 0.192494 0.126769 0.147986 0.114833 0.114052 0.133006 0.115627 0.113232 0.140661 0.217798
qa: 0.8862 -0.4921 -0.5211 -0.5354 -0.4741 -0.5078 -0.3002 -0.2976 -0.2325 -0.1047 -0.1116 -0.1300 -0.4289 -0.4345 -0.0716 0.0334 -0.1328 0.0779 -0.1413 0.3269 -0.1213 -0.1595 -0.1742 0.3848 0.3806 0.2815 0.4197 0.4268 -0.3242 -0.1147 -0.1291 0.1481 0.1489 0.1482 0.1825 0.1097 0.1252 0.1099 0.1093 0.1057 0.1175 0.1925 0.1268 0.1480 0.1148 0.1141 0.1330 0.1156 0.1132 0.1407 0.2178
va: 5.7886 1.9882 1.9615 1.9570 2.0382 1.9807 2.1215 2.1316 3.0782 3.1507 3.2477 3.1904 2.9695 2.9707 3.7582 3.6848 3.9560 4.0485 4.0318 4.0949 3.9165 3.8818 3.8966 4.3865 4.2324 4.1010 4.0171 3.9811 3.9305 3.8450 3.8447 1.0519 1.0035 1.0010 0.9987 0.9972 0.9943 1.0050 0.9970 1.0089 0.9917 1.0171 0.9921 1.0156 0.9953 0.9956 0.9933 0.9905 0.9935 0.9958 1.0599
dispcorr: -0.029077006 hartree
energy: -1913.401767952953
dipole: -3.49701 2.13993 -1.35708 0.56494 -4.39865 -3.83371 -10.67091 8.09144 -2.57947
magnitude: 4.81588 au
magnitude: 12.24099 debye
