program: Orca
programVersion: 4.2.1
elementType: S O O O O O O O N N N N N N C C C C C C C C C C C C C C C C C H H H H H H H H H H H H H H H H H H H H
charge: 0
multiplicity: 1
keywords: wb97x-d3
keywords: def2-TZVPP
keywords: def2/J RIJCOSX GRIDX6 NOFINALGRIDX
keywords: grid4 nofinalgrid
keywords: scfconv7
keywords: smallprint printgap noloewdin
keywords: NOSOSCF
formula: C17H20N6O7S
InChI: InChI=1S/C17H20N6O7S/c1-23(2)15(25)11-6-5-10(18-9-24)7-12(11)31(27,28)22-17(26)21-16-19-13(29-3)8-14(20-16)30-4/h5-9,18,21-22H,1-4H3
51 atoms
S  -0.331423 1.705729 0.529804
O  -0.319108 2.827643 -0.384614
O  0.04291 1.91176 1.916429
O  -3.032193 3.867289 0.632032
O  -0.220269 0.271761 -2.043034
O  -1.283057 -3.046361 1.876783
O  5.211846 -3.726065 -1.217153
O  4.107613 -0.944934 2.332338
N  0.716591 0.526762 0.009514
N  -3.111484 3.453836 -1.593906
N  -3.380937 -2.389215 1.233848
N  1.624281 -0.932739 -1.550345
N  3.412103 -2.327855 -1.390305
N  2.856045 -0.919902 0.419851
C  -1.914247 0.911125 0.447038
C  -3.019619 1.611797 -0.010441
C  -1.984254 -0.404148 0.882392
C  -3.206276 -1.066479 0.839502
C  -4.234768 0.933161 -0.038144
C  -3.01602 3.08425 -0.311234
C  -4.328207 -0.380325 0.371171
C  -2.748664 2.582243 -2.693399
C  -3.117947 4.868647 -1.908568
C  0.649609 -0.014719 -1.247779
C  2.676296 -1.40831 -0.795392
C  -2.466289 -3.266802 1.701025
C  4.431841 -2.799942 -0.686413
C  3.88381 -1.401804 1.112421
C  4.731353 -2.3681 0.600399
C  4.927219 -4.202416 -2.530845
C  3.241759 0.055259 2.865342
H  -1.100651 -0.914879 1.229865
H  -5.126024 1.438858 -0.384379
H  -5.286996 -0.881602 0.328536
H  -4.319729 -2.752477 1.150776
H  -3.469337 2.688154 -3.503009
H  -2.733192 1.540652 -2.391357
H  -1.760048 2.837624 -3.078128
H  -3.54723 5.006808 -2.898762
H  -3.722003 5.425857 -1.198108
H  -2.107435 5.283783 -1.911953
H  1.538736 -1.340485 -2.472038
H  -2.924439 -4.24025 1.912747
H  5.566091 -2.760291 1.162145
H  5.688062 -4.948358 -2.742296
H  4.991425 -3.406172 -3.271529
H  3.944078 -4.668434 -2.586003
H  3.258305 0.964636 2.264453
H  3.629292 0.282368 3.854281
H  2.21888 -0.309077 2.964627
H  1.500598 0.240319 0.615115
elementType: S O N C H
totalener: -1913.37263246 hartree
nucrepener: 3482.75153729 hartree
electener: -5396.12416975 hartree
oneelecener: -9549.85725878 hartree
twoeener: 4153.73308903 hartree
cpcmener: -0.07785648 hartree
kineticenergy: 1906.38908607 hartree
xcener: -159.209559793450 hartree
chargesum: -0.0000000
charge: 0.884590 -0.490932 -0.521823 -0.533933 -0.473148 -0.507234 -0.300235 -0.297578 -0.229146 -0.106567 -0.111944 -0.129694 -0.428579 -0.434739 -0.074895 0.037968 -0.131588 0.076969 -0.142213 0.322334 -0.120483 -0.159126 -0.174710 0.379828 0.379040 0.281249 0.420918 0.427485 -0.324730 -0.115094 -0.128274 0.151304 0.149368 0.148178 0.182490 0.125056 0.110429 0.109113 0.109157 0.105870 0.117496 0.192663 0.126472 0.147929 0.133191 0.114423 0.114570 0.115107 0.140716 0.113303 0.219449
qa: 0.8846 -0.4909 -0.5218 -0.5339 -0.4731 -0.5072 -0.3002 -0.2976 -0.2291 -0.1066 -0.1119 -0.1297 -0.4286 -0.4347 -0.0749 0.0380 -0.1316 0.0770 -0.1422 0.3223 -0.1205 -0.1591 -0.1747 0.3798 0.3790 0.2812 0.4209 0.4275 -0.3247 -0.1151 -0.1283 0.1513 0.1494 0.1482 0.1825 0.1251 0.1104 0.1091 0.1092 0.1059 0.1175 0.1927 0.1265 0.1479 0.1332 0.1144 0.1146 0.1151 0.1407 0.1133 0.2194
va: 5.7895 1.9902 1.9602 1.9584 2.0376 1.9806 2.1217 2.1321 3.0759 3.1495 3.2480 3.1907 2.9695 2.9696 3.7538 3.6816 3.9449 4.0527 4.0333 4.0995 3.9147 3.8819 3.8966 4.3898 4.2335 4.1014 4.0155 3.9806 3.9303 3.8450 3.8448 1.0471 1.0034 1.0010 0.9987 0.9948 1.0044 0.9976 0.9971 1.0092 0.9917 1.0170 0.9923 1.0156 0.9933 0.9952 0.9955 0.9920 0.9958 0.9917 1.0589
dispcorr: -0.029279505 hartree
energy: -1913.401911967079
dipole: -4.33190 2.96300 -1.36889 -0.41279 -3.71453 -4.12732 -10.20758 7.90246 -2.30512
magnitude: 4.92161 au
magnitude: 12.50973 debye
