program: Orca
programVersion: 4.2.1
elementType: S O O O O O O O N N N N N N C C C C C C C C C C C C C C C C C H H H H H H H H H H H H H H H H H H H H
charge: 0
multiplicity: 1
keywords: wb97x-d3
keywords: def2-TZVPP
keywords: def2/J RIJCOSX GRIDX6 NOFINALGRIDX
keywords: grid4 nofinalgrid
keywords: scfconv7
keywords: smallprint printgap noloewdin
keywords: NOSOSCF
formula: C17H20N6O7S
InChI: InChI=1S/C17H20N6O7S/c1-23(2)15(25)11-6-5-10(18-9-24)7-12(11)31(27,28)22-17(26)21-16-19-13(29-3)8-14(20-16)30-4/h5-9,18,21-22H,1-4H3
51 atoms
S  -1.162986 1.081476 -1.150559
O  -1.821945 0.934444 -2.43113
O  -0.689068 2.388404 -0.734495
O  0.331249 0.888669 1.949257
O  -0.819433 -1.796258 -1.74197
O  -5.396278 -1.585947 -1.896783
O  5.755802 -2.786699 -0.36577
O  4.162356 1.541704 0.144486
N  0.202095 0.135434 -1.119487
N  -0.93204 2.726696 2.349683
N  -5.233445 -1.693989 0.386029
N  1.379579 -1.861597 -1.246601
N  3.560572 -2.328225 -0.811911
N  2.756158 -0.124907 -0.546464
C  -2.211899 0.418123 0.114985
C  -1.95351 0.712344 1.449447
C  -3.286706 -0.359215 -0.287024
C  -4.133537 -0.892872 0.681353
C  -2.805071 0.162467 2.399221
C  -0.745265 1.474656 1.913354
C  -3.873229 -0.628648 2.02509
C  -2.105517 3.511592 2.021942
C  0.225638 3.503209 2.7479
C  0.182074 -1.205155 -1.3935
C  2.618152 -1.403838 -0.848836
C  -5.785615 -1.978162 -0.813183
C  4.7620 -1.916497 -0.432361
C  3.967691 0.272178 -0.168923
C  5.040804 -0.598239 -0.092229
C  5.50608 -4.152061 -0.692289
C  3.050814 2.436848 0.118102
H  -3.457515 -0.546883 -1.333222
H  -2.636341 0.355363 3.450097
H  -4.518272 -1.04156 2.790384
H  -5.715424 -2.089217 1.180848
H  -2.949286 2.883606 1.754003
H  -1.903122 4.185514 1.187867
H  -2.398013 4.111124 2.882558
H  0.952428 2.886291 3.267572
H  0.709288 3.967949 1.884907
H  -0.094091 4.292892 3.424966
H  1.336433 -2.849166 -1.460071
H  -6.662069 -2.627332 -0.700064
H  6.024468 -0.276122 0.215948
H  6.454542 -4.6634 -0.554178
H  5.184839 -4.267442 -1.726863
H  4.761923 -4.595276 -0.0315
H  2.276072 2.124518 0.817298
H  2.633102 2.530895 -0.884485
H  3.443568 3.401539 0.427236
H  1.071253 0.533153 -0.735558
elementType: S O N C H
totalener: -1913.37495336 hartree
nucrepener: 3514.02258780 hartree
electener: -5427.39754116 hartree
oneelecener: -9612.66988330 hartree
twoeener: 4185.27234214 hartree
cpcmener: -0.07634984 hartree
kineticenergy: 1906.37787099 hartree
xcener: -159.208966037401 hartree
chargesum: 0.0000000
charge: 0.881232 -0.506307 -0.509135 -0.519137 -0.488058 -0.511172 -0.301599 -0.301688 -0.194170 -0.100019 -0.115385 -0.135207 -0.427688 -0.424779 -0.102983 -0.019108 -0.025288 0.091891 -0.132028 0.291224 -0.133222 -0.165854 -0.188065 0.382812 0.368700 0.283667 0.419964 0.423996 -0.329890 -0.114598 -0.115562 0.138279 0.152393 0.148831 0.182863 0.117723 0.112900 0.121787 0.111623 0.114978 0.117653 0.190781 0.125289 0.146929 0.132456 0.114171 0.114329 0.093389 0.117994 0.142727 0.220362
qa: 0.8812 -0.5063 -0.5091 -0.5191 -0.4881 -0.5112 -0.3016 -0.3017 -0.1942 -0.1000 -0.1154 -0.1352 -0.4277 -0.4248 -0.1030 -0.0191 -0.0253 0.0919 -0.1320 0.2912 -0.1332 -0.1659 -0.1881 0.3828 0.3687 0.2837 0.4200 0.4240 -0.3299 -0.1146 -0.1156 0.1383 0.1524 0.1488 0.1829 0.1177 0.1129 0.1218 0.1116 0.1150 0.1177 0.1908 0.1253 0.1469 0.1325 0.1142 0.1143 0.0934 0.1180 0.1427 0.2204
va: 5.8054 1.9871 1.9800 1.9705 2.0261 1.9740 2.1190 2.1300 3.0889 3.1618 3.2430 3.1798 2.9672 2.9713 3.8633 3.7624 3.8241 4.0263 4.0127 4.1090 3.9482 3.8858 3.8845 4.4008 4.2514 4.0995 4.0161 3.9831 3.9346 3.8460 3.8347 1.0845 1.0014 1.0009 0.9985 0.9948 0.9945 0.9960 1.0093 0.9896 0.9998 1.0179 0.9925 1.0162 0.9935 0.9953 0.9954 1.0064 0.9948 0.9956 1.0528
dispcorr: -0.030761683 hartree
energy: -1913.405715038956
dipole: 4.41237 -4.78322 -0.37085 8.38967 -8.67527 -0.28560 15.28713 -10.76212 4.52501
magnitude: 4.54915 au
magnitude: 11.56303 debye
