program: Orca
programVersion: 4.2.1
elementType: S O O O O O O O N N N N N N C C C C C C C C C C C C C C C C C H H H H H H H H H H H H H H H H H H H H
charge: 0
multiplicity: 1
keywords: wb97x-d3
keywords: def2-TZVPP
keywords: def2/J RIJCOSX GRIDX6 NOFINALGRIDX
keywords: grid4 nofinalgrid
keywords: scfconv7
keywords: smallprint printgap noloewdin
keywords: NOSOSCF
formula: C17H20N6O7S
InChI: InChI=1S/C17H20N6O7S/c1-23(2)15(25)11-6-5-10(18-9-24)7-12(11)31(27,28)22-17(26)21-16-19-13(29-3)8-14(20-16)30-4/h5-9,18,21-22H,1-4H3
51 atoms
S  -1.028398 1.313773 -1.45615
O  -1.653725 1.302062 -2.761495
O  -0.576553 2.570483 -0.888351
O  0.41372 0.642366 1.56695
O  -0.6903 -1.509154 -2.235178
O  -6.266743 -2.382851 1.294104
O  5.488868 -2.872881 0.203833
O  4.159322 1.572803 0.309387
N  0.341381 0.373662 -1.492412
N  -0.783534 2.409275 2.327713
N  -5.169042 -1.458469 -0.493965
N  1.438371 -1.674068 -1.510475
N  3.459227 -2.276254 -0.663227
N  2.797397 -0.011355 -0.621835
C  -2.111027 0.520891 -0.298078
C  -1.878951 0.643246 1.070065
C  -3.202612 -0.16403 -0.795108
C  -4.098289 -0.778109 0.079268
C  -2.784336 0.031964 1.924248
C  -0.641169 1.261975 1.653801
C  -3.878785 -0.673684 1.451258
C  -1.919563 3.294063 2.170491
C  0.375282 3.009532 2.95769
C  0.293437 -0.965514 -1.776676
C  2.614782 -1.289203 -0.900751
C  -6.137508 -2.188995 0.100654
C  4.594926 -1.937184 -0.069784
C  3.933797 0.310129 -0.01234
C  4.900403 -0.631466 0.29502
C  5.203971 -4.226209 -0.143421
C  3.144716 2.541798 0.050539
H  -3.370088 -0.229057 -1.8617
H  -2.63955 0.100601 2.994136
H  -4.547785 -1.129252 2.161795
H  -5.22227 -1.427471 -1.502184
H  -2.301622 3.595243 3.145014
H  -2.728382 2.820372 1.624334
H  -1.627864 4.193312 1.625733
H  0.916072 3.660062 2.266603
H  0.045076 3.613201 3.801086
H  1.05592 2.249784 3.329036
H  1.371042 -2.660177 -1.724879
H  -6.825418 -2.607201 -0.643891
H  5.825562 -0.370135 0.787082
H  4.312927 -4.594187 0.363932
H  6.065248 -4.800002 0.18689
H  5.083904 -4.349358 -1.219183
H  3.541978 3.486909 0.409881
H  2.230276 2.308341 0.594645
H  2.931243 2.630445 -1.01474
H  1.180481 0.717222 -1.002229
elementType: S O N C H
totalener: -1913.37352053 hartree
nucrepener: 3516.24617903 hartree
electener: -5429.61969955 hartree
oneelecener: -9615.98816478 hartree
twoeener: 4186.36846522 hartree
cpcmener: -0.06450265 hartree
kineticenergy: 1906.38902968 hartree
xcener: -159.210367592157 hartree
chargesum: -0.0000000
charge: 0.887123 -0.507583 -0.510112 -0.511376 -0.483345 -0.509350 -0.301747 -0.300344 -0.194740 -0.090796 -0.115679 -0.135823 -0.425971 -0.410798 -0.121455 -0.015221 0.024138 0.097094 -0.137319 0.278116 -0.173967 -0.165770 -0.189897 0.370666 0.361493 0.283981 0.420795 0.423096 -0.331305 -0.114864 -0.098570 0.126751 0.148655 0.163612 0.180184 0.123574 0.116533 0.116257 0.115062 0.119279 0.113203 0.191519 0.123925 0.147300 0.114497 0.132563 0.113984 0.142496 0.068066 0.126129 0.215941
qa: 0.8871 -0.5076 -0.5101 -0.5114 -0.4833 -0.5093 -0.3017 -0.3003 -0.1947 -0.0908 -0.1157 -0.1358 -0.4260 -0.4108 -0.1215 -0.0152 0.0241 0.0971 -0.1373 0.2781 -0.1740 -0.1658 -0.1899 0.3707 0.3615 0.2840 0.4208 0.4231 -0.3313 -0.1149 -0.0986 0.1268 0.1487 0.1636 0.1802 0.1236 0.1165 0.1163 0.1151 0.1193 0.1132 0.1915 0.1239 0.1473 0.1145 0.1326 0.1140 0.1425 0.0681 0.1261 0.2159
va: 5.8061 1.9854 1.9777 1.9776 2.0306 1.9744 2.1190 2.1275 3.0820 3.1538 3.2470 3.1808 2.9685 2.9673 3.8595 3.7210 3.8602 4.0077 4.0308 4.1094 3.9602 3.8844 3.8825 4.4129 4.2587 4.1013 4.0150 3.9818 3.9375 3.8459 3.8430 1.0429 1.0052 1.0296 1.0010 0.9938 0.9963 0.9922 0.9901 0.9977 1.0115 1.0174 0.9930 1.0160 0.9955 0.9936 0.9953 0.9963 0.9920 0.9952 1.0642
dispcorr: -0.030988989 hartree
energy: -1913.404509515975
dipole: 5.17194 -4.69904 0.47290 7.25477 -6.87265 0.38212 13.99580 -12.96862 1.02718
magnitude: 1.19362 au
magnitude: 3.03395 debye
