program: Orca
programVersion: 4.2.1
elementType: S O O O O O O O N N N N N N C C C C C C C C C C C C C C C C C H H H H H H H H H H H H H H H H H H H H
charge: 0
multiplicity: 1
keywords: wb97x-d3
keywords: def2-TZVPP
keywords: def2/J RIJCOSX GRIDX6 NOFINALGRIDX
keywords: grid4 nofinalgrid
keywords: scfconv7
keywords: smallprint printgap noloewdin
keywords: NOSOSCF
formula: C17H20N6O7S
InChI: InChI=1S/C17H20N6O7S/c1-23(2)15(25)11-6-5-10(18-9-24)7-12(11)31(27,28)22-17(26)21-16-19-13(29-3)8-14(20-16)30-4/h5-9,18,21-22H,1-4H3
51 atoms
S  -0.991294 1.29466 -1.378731
O  -1.579803 1.279696 -2.701376
O  -0.528197 2.548722 -0.814448
O  0.31272 0.788379 1.75483
O  -0.664712 -1.519837 -2.214217
O  -6.289763 -2.385674 1.274837
O  5.594118 -2.938332 -0.009137
O  4.203774 1.469765 0.405313
N  0.356078 0.323504 -1.362885
N  -0.951135 2.579701 2.324883
N  -5.121532 -1.516176 -0.495703
N  1.469232 -1.709362 -1.511207
N  3.527277 -2.326681 -0.771135
N  2.824521 -0.084005 -0.551691
C  -2.117299 0.53578 -0.241563
C  -1.947058 0.712485 1.129403
C  -3.17217 -0.190132 -0.759475
C  -4.090571 -0.793515 0.098287
C  -2.873448 0.109369 1.966526
C  -0.754701 1.391658 1.740282
C  -3.930905 -0.63808 1.47369
C  -2.086514 3.431237 2.031813
C  0.180748 3.254606 2.928076
C  0.317033 -0.995273 -1.729206
C  2.658003 -1.343365 -0.914689
C  -6.106796 -2.237482 0.081784
C  4.677916 -2.003489 -0.198016
C  3.984425 0.224285 0.020362
C  4.978913 -0.715386 0.227899
C  5.310437 -4.278254 -0.406183
C  3.164941 2.435337 0.243496
H  -3.294479 -0.295037 -1.828986
H  -2.775294 0.218813 3.038217
H  -4.617947 -1.086061 2.171748
H  -5.128998 -1.52384 -1.505624
H  -2.883335 2.884389 1.539174
H  -1.790351 4.25624 1.382539
H  -2.487267 3.849628 2.953706
H  0.763962 3.802563 2.184866
H  -0.185236 3.966956 3.664567
H  0.832448 2.550054 3.435115
H  1.406784 -2.682325 -1.780451
H  -6.75087 -2.698271 -0.676668
H  5.920111 -0.466575 0.695472
H  5.1594 -4.356316 -1.482261
H  4.438343 -4.676518 0.110989
H  6.185944 -4.857128 -0.126174
H  3.564615 3.365288 0.638236
H  2.2777 2.157533 0.81136
H  2.907948 2.579124 -0.806167
H  1.199936 0.656902 -0.873974
elementType: S O N C H
totalener: -1913.37468298 hartree
nucrepener: 3500.55644871 hartree
electener: -5413.93113169 hartree
oneelecener: -9584.49799593 hartree
twoeener: 4170.56686424 hartree
cpcmener: -0.06511620 hartree
kineticenergy: 1906.38542521 hartree
xcener: -159.210364995698 hartree
chargesum: -0.0000000
charge: 0.882625 -0.506612 -0.508457 -0.518715 -0.488873 -0.509774 -0.301455 -0.301118 -0.194943 -0.097187 -0.115611 -0.136570 -0.427336 -0.420067 -0.109231 -0.016565 0.019698 0.096148 -0.136181 0.288112 -0.173667 -0.166121 -0.185941 0.381695 0.366296 0.283686 0.420894 0.425260 -0.331297 -0.114463 -0.105859 0.125097 0.148135 0.163704 0.179938 0.117774 0.114525 0.122981 0.114131 0.116835 0.112192 0.191220 0.124169 0.147089 0.114254 0.114465 0.132084 0.141745 0.080100 0.121947 0.219243
qa: 0.8826 -0.5066 -0.5085 -0.5187 -0.4889 -0.5098 -0.3015 -0.3011 -0.1949 -0.0972 -0.1156 -0.1366 -0.4273 -0.4201 -0.1092 -0.0166 0.0197 0.0961 -0.1362 0.2881 -0.1737 -0.1661 -0.1859 0.3817 0.3663 0.2837 0.4209 0.4253 -0.3313 -0.1145 -0.1059 0.1251 0.1481 0.1637 0.1799 0.1178 0.1145 0.1230 0.1141 0.1168 0.1122 0.1912 0.1242 0.1471 0.1143 0.1145 0.1321 0.1417 0.0801 0.1219 0.2192
va: 5.8077 1.9861 1.9801 1.9702 2.0243 1.9741 2.1192 2.1297 3.0857 3.1575 3.2470 3.1812 2.9674 2.9691 3.8417 3.7473 3.8688 4.0094 4.0327 4.1029 3.9604 3.8861 3.8865 4.4021 4.2537 4.1013 4.0150 3.9805 3.9357 3.8458 3.8375 1.0448 1.0056 1.0295 1.0012 0.9955 0.9927 0.9946 0.9906 0.9984 1.0095 1.0176 0.9929 1.0162 0.9951 0.9956 0.9938 0.9964 1.0023 0.9946 1.0571
dispcorr: -0.030595525 hartree
energy: -1913.405278503544
dipole: 4.60847 -4.14907 0.45940 7.70958 -7.38057 0.32900 13.04236 -12.27290 0.76946
magnitude: 0.95465 au
magnitude: 2.42653 debye
