program: Orca
programVersion: 4.2.1
elementType: S O O O O O O O N N N N N N C C C C C C C C C C C C C C C C C H H H H H H H H H H H H H H H H H H H H
charge: 0
multiplicity: 1
keywords: wb97x-d3
keywords: def2-TZVPP
keywords: def2/J RIJCOSX GRIDX6 NOFINALGRIDX
keywords: grid4 nofinalgrid
keywords: scfconv7
keywords: smallprint printgap noloewdin
keywords: NOSOSCF
formula: C17H20N6O7S
InChI: InChI=1S/C17H20N6O7S/c1-23(2)15(25)11-6-5-10(18-9-24)7-12(11)31(27,28)22-17(26)21-16-19-13(29-3)8-14(20-16)30-4/h5-9,18,21-22H,1-4H3
51 atoms
S  -0.974421 1.259647 -1.344689
O  -1.526657 1.223404 -2.682725
O  -0.513741 2.519941 -0.792827
O  0.214577 0.844859 1.85206
O  -0.642035 -1.561065 -2.15441
O  -6.354938 -2.347806 1.242359
O  5.712112 -2.914358 -0.191707
O  4.21379 1.423239 0.50351
N  0.362478 0.277064 -1.273381
N  -1.04876 2.673227 2.289345
N  -5.128167 -1.534325 -0.515195
N  1.492739 -1.743656 -1.4540
N  3.596368 -2.330543 -0.830238
N  2.837546 -0.124653 -0.46796
C  -2.139696 0.535707 -0.224828
C  -2.018327 0.757937 1.144757
C  -3.174103 -0.210527 -0.755244
C  -4.121261 -0.786953 0.089584
C  -2.973707 0.182508 1.968713
C  -0.844765 1.456536 1.769623
C  -4.012443 -0.583129 1.463833
C  -2.166243 3.516789 1.915153
C  0.078897 3.373473 2.871801
C  0.334536 -1.035972 -1.660031
C  2.693519 -1.36883 -0.888916
C  -6.130241 -2.240804 0.052283
C  4.761055 -2.000543 -0.290668
C  4.012953 0.19128 0.067929
C  5.042425 -0.726144 0.18703
C  5.454742 -4.236008 -0.662398
C  3.144311 2.365965 0.426117
H  -3.25663 -0.353237 -1.824183
H  -2.912968 0.328401 3.038872
H  -4.724672 -1.008222 2.151077
H  -5.099728 -1.579835 -1.523654
H  -2.568123 4.013432 2.797092
H  -2.968534 2.943379 1.461872
H  -1.85185 4.282704 1.204312
H  -0.292904 4.142757 3.54574
H  0.706818 2.697232 3.444159
H  0.68848 3.857379 2.104785
H  1.443559 -2.708119 -1.754566
H  -6.745044 -2.731121 -0.712192
H  5.995887 -0.470551 0.625195
H  4.621944 -4.697773 -0.133363
H  6.361638 -4.799164 -0.461058
H  5.254867 -4.250277 -1.733258
H  2.28495 2.036588 1.008942
H  2.846566 2.553067 -0.605855
H  3.533906 3.286701 0.851404
H  1.197232 0.612072 -0.771551
elementType: S O N C H
totalener: -1913.37398957 hartree
nucrepener: 3491.88881799 hartree
electener: -5405.26280755 hartree
oneelecener: -9567.06516229 hartree
twoeener: 4161.80235473 hartree
cpcmener: -0.06343685 hartree
kineticenergy: 1906.38116481 hartree
xcener: -159.209380085619 hartree
chargesum: 0.0000000
charge: 0.880987 -0.506624 -0.507979 -0.515874 -0.486989 -0.507147 -0.301663 -0.301820 -0.193927 -0.101425 -0.116541 -0.136499 -0.426966 -0.424925 -0.112233 -0.018171 0.030628 0.094142 -0.137057 0.291591 -0.172502 -0.167468 -0.185653 0.383101 0.369193 0.281637 0.418231 0.424767 -0.331443 -0.112477 -0.116764 0.118884 0.150887 0.165381 0.178003 0.122243 0.118047 0.114573 0.114919 0.113325 0.114206 0.190853 0.124038 0.147219 0.113754 0.131893 0.114464 0.093460 0.118329 0.142275 0.221117
qa: 0.8810 -0.5066 -0.5080 -0.5159 -0.4870 -0.5071 -0.3017 -0.3018 -0.1939 -0.1014 -0.1165 -0.1365 -0.4270 -0.4249 -0.1122 -0.0182 0.0306 0.0941 -0.1371 0.2916 -0.1725 -0.1675 -0.1857 0.3831 0.3692 0.2816 0.4182 0.4248 -0.3314 -0.1125 -0.1168 0.1189 0.1509 0.1654 0.1780 0.1222 0.1180 0.1146 0.1149 0.1133 0.1142 0.1909 0.1240 0.1472 0.1138 0.1319 0.1145 0.0935 0.1183 0.1423 0.2211
va: 5.8078 1.9862 1.9811 1.9766 2.0261 1.9776 2.1193 2.1296 3.0884 3.1557 3.2464 3.1805 2.9661 2.9714 3.8542 3.7519 3.8710 4.0062 4.0252 4.1057 3.9544 3.8868 3.8875 4.3996 4.2501 4.1046 4.0189 3.9828 3.9359 3.8448 3.8336 1.0477 1.0044 1.0285 1.0024 0.9950 0.9951 0.9929 0.9996 1.0075 0.9900 1.0180 0.9929 1.0162 0.9960 0.9936 0.9955 1.0077 0.9945 0.9959 1.0523
dispcorr: -0.030458053 hartree
energy: -1913.404447620834
dipole: 4.46661 -3.97113 0.49548 8.13282 -7.81089 0.32193 12.23962 -11.63045 0.60917
magnitude: 0.84866 au
magnitude: 2.15713 debye
