program: Orca
programVersion: 4.2.1
elementType: S O O O O O O O N N N N N N C C C C C C C C C C C C C C C C C H H H H H H H H H H H H H H H H H H H H
charge: 0
multiplicity: 1
keywords: wb97x-d3
keywords: def2-TZVPP
keywords: def2/J RIJCOSX GRIDX6 NOFINALGRIDX
keywords: grid4 nofinalgrid
keywords: scfconv7
keywords: smallprint printgap noloewdin
keywords: NOSOSCF
formula: C17H20N6O7S
InChI: InChI=1S/C17H20N6O7S/c1-23(2)15(25)11-6-5-10(18-9-24)7-12(11)31(27,28)22-17(26)21-16-19-13(29-3)8-14(20-16)30-4/h5-9,18,21-22H,1-4H3
51 atoms
S  -0.346059 1.626799 0.608434
O  -0.277332 2.778677 -0.264675
O  0.004358 1.758422 2.009437
O  -3.008041 3.876188 0.633546
O  -0.207709 0.257656 -2.01995
O  -1.517488 -3.103402 1.863462
O  5.326344 -3.606714 -1.284313
O  4.101457 -1.005635 2.361814
N  0.672564 0.429848 0.06657
N  -2.957385 3.501837 -1.600527
N  -3.568716 -2.354705 1.174043
N  1.63904 -0.945972 -1.531193
N  3.478069 -2.275922 -1.40903
N  2.85659 -0.964526 0.448756
C  -1.952785 0.892323 0.458285
C  -3.011119 1.63386 -0.043161
C  -2.08831 -0.420131 0.887267
C  -3.329671 -1.039631 0.787557
C  -4.245996 0.996984 -0.130438
C  -2.95211 3.112039 -0.319414
C  -4.403804 -0.313527 0.268138
C  -2.605996 2.631164 -2.700938
C  -2.935567 4.916579 -1.903747
C  0.643497 -0.051021 -1.216205
C  2.701983 -1.409497 -0.786659
C  -2.701709 -3.272123 1.66009
C  4.513336 -2.733654 -0.719604
C  3.901974 -1.426871 1.12768
C  4.792232 -2.337235 0.583717
C  5.053867 -4.039522 -2.614337
C  3.188628 -0.068759 2.92885
H  -1.238683 -0.960109 1.274524
H  -5.101119 1.53571 -0.517325
H  -5.377373 -0.779729 0.178148
H  -4.518714 -2.679266 1.065387
H  -2.622423 1.586688 -2.408297
H  -1.604196 2.859675 -3.069621
H  -3.312279 2.764747 -3.520558
H  -3.401917 5.080519 -2.874303
H  -3.488006 5.484536 -1.160631
H  -1.912906 5.300229 -1.94643
H  1.581606 -1.318402 -2.470008
H  -3.207231 -4.22636 1.858725
H  5.641845 -2.714022 1.134134
H  4.088768 -4.54151 -2.68548
H  5.842805 -4.745666 -2.859876
H  5.080767 -3.211607 -3.322918
H  2.183582 -0.484599 3.011454
H  3.161362 0.863502 2.363606
H  3.56369 0.138772 3.927484
H  1.452499 0.132785 0.671704
elementType: S O N C H
totalener: -1913.37358181 hartree
nucrepener: 3476.30541444 hartree
electener: -5389.67899625 hartree
oneelecener: -9536.67827834 hartree
twoeener: 4146.99928209 hartree
cpcmener: -0.06259766 hartree
kineticenergy: 1906.40622939 hartree
xcener: -159.208792974485 hartree
chargesum: -0.0000000
charge: 0.878309 -0.480077 -0.509022 -0.501109 -0.454953 -0.478637 -0.291703 -0.289145 -0.233327 -0.103556 -0.118431 -0.135024 -0.428818 -0.434076 -0.067390 0.037311 -0.139747 0.082626 -0.143320 0.305167 -0.125403 -0.161156 -0.175371 0.374494 0.377347 0.269021 0.414405 0.421973 -0.323664 -0.116340 -0.128019 0.147128 0.146183 0.143343 0.175717 0.109097 0.109303 0.121756 0.106350 0.106514 0.116947 0.188815 0.119007 0.145570 0.113366 0.131635 0.113418 0.113437 0.114009 0.138594 0.217446
qa: 0.8783 -0.4801 -0.5090 -0.5011 -0.4550 -0.4786 -0.2917 -0.2891 -0.2333 -0.1036 -0.1184 -0.1350 -0.4288 -0.4341 -0.0674 0.0373 -0.1397 0.0826 -0.1433 0.3052 -0.1254 -0.1612 -0.1754 0.3745 0.3773 0.2690 0.4144 0.4220 -0.3237 -0.1163 -0.1280 0.1471 0.1462 0.1433 0.1757 0.1091 0.1093 0.1218 0.1064 0.1065 0.1169 0.1888 0.1190 0.1456 0.1134 0.1316 0.1134 0.1134 0.1140 0.1386 0.2174
va: 5.8036 2.0029 1.9775 2.0020 2.0619 2.0143 2.1314 2.1418 3.0720 3.1437 3.2388 3.1831 2.9674 2.9702 3.7550 3.6852 3.9633 4.0380 4.0396 4.1318 3.9215 3.8831 3.8926 4.3955 4.2361 4.1209 4.0255 3.9920 3.9276 3.8493 3.8484 1.0521 1.0041 1.0023 1.0029 1.0061 0.9974 0.9945 0.9961 1.0140 0.9909 1.0197 0.9937 1.0163 0.9957 0.9935 0.9956 0.9917 0.9933 0.9958 1.0592
dispcorr: -0.029156788 hartree
energy: -1913.402738595042
dipole: -3.77513 2.56308 -1.21205 0.20872 -3.90738 -3.69867 -10.63717 8.32441 -2.31275
magnitude: 4.52747 au
magnitude: 11.50792 debye
