program: Orca
programVersion: 4.2.1
elementType: S O O O O O O O N N N N N N C C C C C C C C C C C C C C C C C H H H H H H H H H H H H H H H H H H H H
charge: 0
multiplicity: 1
keywords: wb97x-d3
keywords: def2-TZVPP
keywords: def2/J RIJCOSX GRIDX6 NOFINALGRIDX
keywords: grid4 nofinalgrid
keywords: scfconv7
keywords: smallprint printgap noloewdin
keywords: NOSOSCF
formula: C17H20N6O7S
InChI: InChI=1S/C17H20N6O7S/c1-23(2)15(25)11-6-5-10(18-9-24)7-12(11)31(27,28)22-17(26)21-16-19-13(29-3)8-14(20-16)30-4/h5-9,18,21-22H,1-4H3
51 atoms
S  -0.996341 1.315003 -1.40766
O  -1.599661 1.306482 -2.721884
O  -0.53115 2.563258 -0.83328
O  0.355535 0.782489 1.690522
O  -0.676627 -1.510618 -2.221443
O  -6.255578 -2.394089 1.288664
O  5.54185 -2.944996 0.059124
O  4.200659 1.486853 0.380677
N  0.3528 0.344891 -1.407475
N  -0.911184 2.554874 2.313166
N  -5.106645 -1.522257 -0.492204
N  1.452972 -1.697126 -1.504869
N  3.495802 -2.318473 -0.731753
N  2.815416 -0.066846 -0.561189
C  -2.106998 0.540955 -0.263432
C  -1.916257 0.702688 1.10614
C  -3.167168 -0.182751 -0.773234
C  -4.071369 -0.798011 0.09169
C  -2.830682 0.091838 1.951068
C  -0.714329 1.37642 1.706166
C  -3.893455 -0.653524 1.466789
C  -2.06314 3.397463 2.074753
C  0.207767 3.212074 2.954091
C  0.304586 -0.981404 -1.746485
C  2.637458 -1.330419 -0.903555
C  -6.085238 -2.246809 0.096645
C  4.64295 -2.000592 -0.150487
C  3.971069 0.238564 0.020153
C  4.952581 -0.70899 0.259527
C  5.240718 -4.280149 -0.336505
C  3.185159 2.465262 0.167152
H  -3.300233 -0.276842 -1.842876
H  -2.717143 0.194789 3.022556
H  -4.571048 -1.110355 2.168931
H  -5.12384 -1.52827 -1.50189
H  -1.790422 4.256229 1.458603
H  -2.459624 3.767684 3.01987
H  -2.857598 2.860938 1.566721
H  0.893704 2.48733 3.382432
H  0.757572 3.843868 2.251882
H  -0.164797 3.845227 3.758155
H  1.389411 -2.675228 -1.754989
H  -6.736067 -2.709733 -0.656888
H  5.890904 -0.461717 0.734222
H  4.358063 -4.66469 0.174816
H  6.105742 -4.872664 -0.050025
H  5.093707 -4.358992 -1.413861
H  3.595138 3.399997 0.541306
H  2.280217 2.223329 0.723851
H  2.95168 2.581951 -0.89196
H  1.195564 0.680183 -0.919164
elementType: S O N C H
totalener: -1913.37615799 hartree
nucrepener: 3505.75638651 hartree
electener: -5419.13254450 hartree
oneelecener: -9594.74604687 hartree
twoeener: 4175.61350237 hartree
cpcmener: -0.05228227 hartree
kineticenergy: 1906.40535166 hartree
xcener: -159.210124629676 hartree
chargesum: -0.0000000
charge: 0.877136 -0.492466 -0.501834 -0.489283 -0.462443 -0.479799 -0.293210 -0.292385 -0.196343 -0.095343 -0.121319 -0.140898 -0.427184 -0.414165 -0.123991 -0.006932 0.020595 0.100123 -0.140476 0.267004 -0.173649 -0.169473 -0.189909 0.365523 0.362347 0.270479 0.414773 0.420205 -0.330363 -0.115680 -0.107300 0.123232 0.146046 0.163251 0.174289 0.115803 0.120211 0.116556 0.112973 0.114058 0.115220 0.187746 0.116824 0.144315 0.113407 0.130497 0.112787 0.138780 0.080906 0.121506 0.217856
qa: 0.8771 -0.4925 -0.5018 -0.4893 -0.4624 -0.4798 -0.2932 -0.2924 -0.1963 -0.0953 -0.1213 -0.1409 -0.4272 -0.4142 -0.1240 -0.0069 0.0206 0.1001 -0.1405 0.2670 -0.1736 -0.1695 -0.1899 0.3655 0.3623 0.2705 0.4148 0.4202 -0.3304 -0.1157 -0.1073 0.1232 0.1460 0.1633 0.1743 0.1158 0.1202 0.1166 0.1130 0.1141 0.1152 0.1877 0.1168 0.1443 0.1134 0.1305 0.1128 0.1388 0.0809 0.1215 0.2179
va: 5.8216 2.0052 1.9882 2.0046 2.0575 2.0098 2.1285 2.1387 3.0822 3.1471 3.2384 3.1748 2.9657 2.9691 3.8658 3.7217 3.8678 3.9990 4.0280 4.1273 3.9638 3.8886 3.8845 4.4194 4.2586 4.1224 4.0245 3.9900 3.9333 3.8504 3.8444 1.0454 1.0059 1.0303 1.0045 0.9922 0.9943 0.9961 1.0116 0.9898 0.9979 1.0202 0.9944 1.0170 0.9958 0.9940 0.9956 0.9964 0.9985 0.9950 1.0579
dispcorr: -0.030655253 hartree
energy: -1913.406813243165
dipole: 4.61910 -4.18910 0.43000 7.51821 -7.27163 0.24658 13.31485 -12.52078 0.79408
magnitude: 0.93609 au
magnitude: 2.37935 debye
