program: Orca
programVersion: 4.2.1
elementType: S O O O O O O O N N N N N N C C C C C C C C C C C C C C C C C H H H H H H H H H H H H H H H H H H H H
charge: 0
multiplicity: 1
keywords: wb97x-d3
keywords: def2-TZVPP
keywords: def2/J RIJCOSX GRIDX6 NOFINALGRIDX
keywords: grid4 nofinalgrid
keywords: scfconv7
keywords: smallprint printgap noloewdin
keywords: NOSOSCF
formula: C17H20N6O7S
InChI: InChI=1S/C17H20N6O7S/c1-23(2)15(25)11-6-5-10(18-9-24)7-12(11)31(27,28)22-17(26)21-16-19-13(29-3)8-14(20-16)30-4/h5-9,18,21-22H,1-4H3
51 atoms
S  -0.941449 1.260485 -1.324924
O  -1.523659 1.224903 -2.642065
O  -0.456061 2.501949 -0.755125
O  0.277274 0.880468 1.86374
O  -0.658855 -1.615539 -2.064083
O  -6.430143 -2.149452 1.310365
O  5.697872 -3.026656 -0.204013
O  4.305376 1.355222 0.439888
N  0.379245 0.247759 -1.259438
N  -1.014545 2.684016 2.329967
N  -5.072821 -1.56107 -0.441653
N  1.490302 -1.788289 -1.410719
N  3.589325 -2.404781 -0.810501
N  2.884402 -0.176036 -0.481877
C  -2.093516 0.534798 -0.184075
C  -1.967233 0.763198 1.181503
C  -3.127732 -0.218698 -0.702375
C  -4.070191 -0.790586 0.148226
C  -2.92385 0.199212 2.012984
C  -0.786683 1.465121 1.793961
C  -3.965351 -0.570192 1.520584
C  -2.12091 3.525213 1.933906
C  0.090041 3.376322 2.953037
C  0.319948 -1.07496 -1.613085
C  2.703866 -1.425097 -0.874255
C  -6.141061 -2.17032 0.142364
C  4.76977 -2.089967 -0.300169
C  4.073362 0.123707 0.030666
C  5.087747 -0.813658 0.147825
C  5.380321 -4.338716 -0.63882
C  3.248634 2.306131 0.379302
H  -3.190804 -0.365582 -1.772721
H  -2.855442 0.359532 3.081361
H  -4.683692 -0.99409 2.20286
H  -4.986322 -1.693201 -1.436503
H  -2.52152 4.04754 2.803443
H  -2.923989 2.941389 1.494882
H  -1.80342 4.267278 1.197528
H  0.652595 3.96884 2.225536
H  -0.294645 4.050739 3.717891
H  0.767465 2.669273 3.422219
H  1.424475 -2.759351 -1.675417
H  -6.740139 -2.707176 -0.611978
H  6.052651 -0.570476 0.564939
H  5.1305 -4.365481 -1.699849
H  4.547918 -4.761847 -0.075619
H  6.27471 -4.930459 -0.462214
H  2.398575 2.000154 0.988753
H  2.913886 2.476993 -0.644659
H  3.666668 3.228728 0.773199
H  1.214667 0.576588 -0.762643
totalener: -1913.34236180 hartree
nucrepener: 3489.47889711 hartree
electener: -5402.82125891 hartree
oneelecener: -9560.99223226 hartree
twoeener: 4158.17097335 hartree
kineticenergy: 1906.45884358 hartree
xcener: -159.206896758191 hartree
chargesum: -0.0000000
charge: 0.860942 -0.432109 -0.476278 -0.413632 -0.393471 -0.367742 -0.265253 -0.265829 -0.200394 -0.115723 -0.151178 -0.166270 -0.410124 -0.416149 -0.173555 0.026902 0.035240 0.116623 -0.133867 0.231251 -0.150245 -0.175882 -0.201255 0.353263 0.363220 0.238506 0.385910 0.407012 -0.305302 -0.124936 -0.135399 0.108840 0.124965 0.159414 0.137246 0.105157 0.110839 0.117345 0.111977 0.099289 0.117298 0.165156 0.072624 0.127234 0.107211 0.108056 0.122465 0.113953 0.110710 0.123136 0.212808
qa: 0.8609 -0.4321 -0.4763 -0.4136 -0.3935 -0.3677 -0.2653 -0.2658 -0.2004 -0.1157 -0.1512 -0.1663 -0.4101 -0.4161 -0.1736 0.0269 0.0352 0.1166 -0.1339 0.2313 -0.1502 -0.1759 -0.2013 0.3533 0.3632 0.2385 0.3859 0.4070 -0.3053 -0.1249 -0.1354 0.1088 0.1250 0.1594 0.1372 0.1052 0.1108 0.1173 0.1120 0.0993 0.1173 0.1652 0.0726 0.1272 0.1072 0.1081 0.1225 0.1140 0.1107 0.1231 0.2128
va: 5.8394 2.0765 2.0129 2.0791 2.1274 2.1254 2.1473 2.1614 3.1031 3.1163 3.2155 3.1654 2.9702 2.9742 4.0175 3.6916 3.8865 3.9680 4.0209 4.1560 4.0016 3.9030 3.9051 4.4043 4.2453 4.1778 4.0555 4.0148 3.9404 3.8782 3.8622 1.0486 1.0129 1.0313 1.0290 0.9955 0.9996 0.9932 0.9888 0.9995 1.0115 1.0380 1.0031 1.0226 0.9969 0.9971 0.9943 1.0074 0.9962 0.9968 1.0531
dispcorr: -0.030278081 hartree
energy: -1913.372639880590
dipole: 4.47302 -3.95815 0.51487 7.82132 -7.85152 -0.03020 12.32181 -11.85843 0.46337
magnitude: 0.69334 au
magnitude: 1.76233 debye
