program: Orca
programVersion: 4.2.1
elementType: S O O O O O O O N N N N N N C C C C C C C C C C C C C C C C C H H H H H H H H H H H H H H H H H H H H
charge: 0
multiplicity: 1
keywords: wb97x-d3
keywords: def2-TZVPP
keywords: def2/J RIJCOSX GRIDX6 NOFINALGRIDX
keywords: grid4 nofinalgrid
keywords: scfconv7
keywords: smallprint printgap noloewdin
keywords: NOSOSCF
formula: C17H20N6O7S
InChI: InChI=1S/C17H20N6O7S/c1-23(2)15(25)11-6-5-10(18-9-24)7-12(11)31(27,28)22-17(26)21-16-19-13(29-3)8-14(20-16)30-4/h5-9,18,21-22H,1-4H3
51 atoms
S  -0.89621 1.241983 -1.3036
O  -1.482164 1.208467 -2.61919
O  -0.397343 2.480409 -0.738691
O  0.32397 0.871067 1.882751
O  -0.644325 -1.63705 -2.039398
O  -6.416729 -2.094178 1.360289
O  5.731654 -3.090335 -0.278496
O  4.36297 1.28816 0.432853
N  0.41438 0.216675 -1.240036
N  -0.954456 2.684537 2.348823
N  -5.062573 -1.521371 -0.399494
N  1.511497 -1.825479 -1.412836
N  3.616257 -2.455712 -0.847555
N  2.924049 -0.227839 -0.486596
C  -2.053144 0.533057 -0.157314
C  -1.923558 0.769102 1.20664
C  -3.097361 -0.210442 -0.669987
C  -4.047611 -0.763053 0.184806
C  -2.886913 0.223214 2.042355
C  -0.735923 1.46315 1.813856
C  -3.939018 -0.535197 1.555694
C  -2.05469 3.533255 1.951105
C  0.157173 3.37055 2.966406
C  0.342969 -1.104445 -1.597571
C  2.733864 -1.471914 -0.889933
C  -6.134324 -2.118548 0.190667
C  4.804959 -2.150198 -0.350758
C  4.121032 0.062322 0.012807
C  5.133896 -0.87946 0.105056
C  5.402424 -4.398142 -0.717027
C  3.307772 2.241985 0.404988
H  -3.162887 -0.364019 -1.739286
H  -2.815823 0.39032 3.109525
H  -4.662973 -0.944138 2.24114
H  -4.983546 -1.654252 -1.394927
H  -2.867627 2.953296 1.525303
H  -1.7354 4.263696 1.203919
H  -2.442944 4.069247 2.817853
H  0.726021 3.951121 2.234102
H  -0.221099 4.055159 3.725408
H  0.827175 2.660523 3.441899
H  1.436915 -2.794143 -1.684093
H  -6.74486 -2.64674 -0.560617
H  6.105511 -0.64399 0.51088
H  5.12533 -4.415569 -1.771368
H  4.584484 -4.82555 -0.136102
H  6.30055 -4.991797 -0.568362
H  2.958664 2.432891 -0.61095
H  3.733303 3.156552 0.809769
H  2.465284 1.927355 1.020964
H  1.255946 0.539359 -0.749826
totalener: -1913.34238387 hartree
nucrepener: 3487.17384854 hartree
electener: -5400.51623241 hartree
oneelecener: -9556.38322244 hartree
twoeener: 4155.86699003 hartree
kineticenergy: 1906.45699071 hartree
xcener: -159.206595106072 hartree
chargesum: -0.0000000
charge: 0.860706 -0.432221 -0.476292 -0.414003 -0.393503 -0.367733 -0.265215 -0.265879 -0.200388 -0.117142 -0.150888 -0.166241 -0.410175 -0.416678 -0.172168 0.027609 0.035597 0.115543 -0.135964 0.232374 -0.149379 -0.175717 -0.200661 0.353626 0.363288 0.238460 0.385578 0.406524 -0.304870 -0.125063 -0.136869 0.108994 0.125150 0.159501 0.137107 0.110730 0.117493 0.104885 0.112290 0.098762 0.117094 0.165236 0.072677 0.127365 0.107071 0.108226 0.122632 0.110536 0.122856 0.115553 0.213586
qa: 0.8607 -0.4322 -0.4763 -0.4140 -0.3935 -0.3677 -0.2652 -0.2659 -0.2004 -0.1171 -0.1509 -0.1662 -0.4102 -0.4167 -0.1722 0.0276 0.0356 0.1155 -0.1360 0.2324 -0.1494 -0.1757 -0.2007 0.3536 0.3633 0.2385 0.3856 0.4065 -0.3049 -0.1251 -0.1369 0.1090 0.1251 0.1595 0.1371 0.1107 0.1175 0.1049 0.1123 0.0988 0.1171 0.1652 0.0727 0.1274 0.1071 0.1082 0.1226 0.1105 0.1229 0.1156 0.2136
va: 5.8400 2.0766 2.0126 2.0793 2.1273 2.1254 2.1473 2.1614 3.1030 3.1158 3.2160 3.1648 2.9701 2.9748 4.0161 3.6896 3.8859 3.9691 4.0205 4.1543 4.0004 3.9026 3.9060 4.4040 4.2451 4.1776 4.0556 4.0154 3.9402 3.8782 3.8617 1.0485 1.0130 1.0314 1.0291 0.9994 0.9933 0.9957 0.9887 0.9997 1.0111 1.0379 1.0031 1.0226 0.9970 0.9969 0.9943 0.9958 0.9970 1.0082 1.0521
dispcorr: -0.030221164 hartree
energy: -1913.372605038380
dipole: 4.54869 -4.03970 0.50899 7.84802 -7.87848 -0.03046 12.26220 -11.81162 0.45058
magnitude: 0.68045 au
magnitude: 1.72958 debye
