program: Orca
programVersion: 4.2.1
elementType: S O O O O O O N N N N N C C C C C C C C C C C C C C C C C H H H H H H H H H H H H H H H H H H H
charge: 0
multiplicity: 1
keywords: wb97x-d3
keywords: def2-TZVPP
keywords: def2/J RIJCOSX GRIDX6 NOFINALGRIDX
keywords: grid4 nofinalgrid
keywords: scfconv7
keywords: smallprint printgap noloewdin
keywords: NOSOSCF
formula: C17H19N5O6S
InChI: InChI=1S/C17H19N5O6S/c1-27-13-9-14(28-2)19-16(18-13)20-17(24)22-29(25,26)21-12-6-4-3-5-11(12)15(23)10-7-8-10/h3-6,9-10,20-22H,7-8H2,1-2H3
48 atoms
S  -0.926681 2.098621 -0.752083
O  -2.8792 -0.831837 0.686158
O  -0.959614 3.184186 0.201065
O  -0.519899 2.324719 -2.117637
O  -0.092009 -0.637307 -1.56239
O  2.866979 2.209558 3.192416
O  5.39476 -1.579039 2.303797
N  -2.416463 1.414747 -0.763252
N  0.116454 1.013731 -0.021076
N  1.554639 -0.812804 -0.031533
N  2.183417 0.723568 1.594049
N  3.465653 -1.204782 1.134959
C  -2.42067 -2.865605 -0.397927
C  -2.9195 -3.752096 0.724429
C  -1.49903 -3.349302 0.697704
C  -2.809678 -1.443571 -0.37117
C  -3.110272 -0.765722 -1.658347
C  -2.886378 0.609573 -1.828622
C  -3.629989 -1.494722 -2.725813
C  -3.16644 1.213448 -3.04548
C  -3.910441 -0.889591 -3.939609
C  -3.666466 0.465242 -4.100034
C  0.486389 -0.16595 -0.604893
C  2.435524 -0.400827 0.946785
C  3.064637 1.088392 2.520475
C  4.332731 -0.828422 2.064284
C  4.18843 0.335001 2.810558
C  1.72234 3.004911 2.890087
C  5.587922 -2.771118 1.546184
H  -2.296439 -3.327796 -1.366389
H  -3.572367 -3.294102 1.456103
H  -3.180359 -4.765548 0.451651
H  -0.757786 -4.079885 0.404129
H  -1.156414 -2.611566 1.411773
H  -3.833441 -2.550426 -2.608185
H  -3.014781 2.276791 -3.164872
H  -2.690791 1.076391 0.157953
H  -4.31876 -1.473435 -4.752831
H  -3.882162 0.950432 -5.04217
H  1.799568 -1.68255 -0.48589
H  4.904865 0.632256 3.562044
H  0.794648 2.461489 3.068881
H  1.74735 3.371005 1.863428
H  1.768943 3.854105 3.565802
H  4.780064 -3.484716 1.704021
H  6.518206 -3.199882 1.908091
H  5.681796 -2.561956 0.481114
H  0.675607 1.349126 0.77466
elementType: S O N C H
totalener: -1782.72986667 hartree
nucrepener: 3124.17783697 hartree
electener: -4906.90770364 hartree
oneelecener: -8654.44227913 hartree
twoeener: 3747.53457549 hartree
cpcmener: -0.04785481 hartree
kineticenergy: 1776.14722784 hartree
xcener: -148.041441542700 hartree
chargesum: -0.0000000
charge: 0.898839 -0.485286 -0.514562 -0.488354 -0.471907 -0.298195 -0.300830 -0.208871 -0.203116 -0.128790 -0.435922 -0.428860 -0.081702 -0.133811 -0.154924 0.296899 -0.007623 0.154094 -0.149040 -0.188854 -0.172512 -0.108514 0.343277 0.383581 0.424097 0.417893 -0.323139 -0.127169 -0.114845 0.108532 0.094309 0.104924 0.107598 0.085981 0.157890 0.140051 0.196704 0.164854 0.165601 0.192559 0.146871 0.118401 0.109915 0.139610 0.114560 0.132766 0.114372 0.212651
qa: 0.8988 -0.4853 -0.5146 -0.4884 -0.4719 -0.2982 -0.3008 -0.2089 -0.2031 -0.1288 -0.4359 -0.4289 -0.0817 -0.1338 -0.1549 0.2969 -0.0076 0.1541 -0.1490 -0.1889 -0.1725 -0.1085 0.3433 0.3836 0.4241 0.4179 -0.3231 -0.1272 -0.1148 0.1085 0.0943 0.1049 0.1076 0.0860 0.1579 0.1401 0.1967 0.1649 0.1656 0.1926 0.1469 0.1184 0.1099 0.1396 0.1146 0.1328 0.1144 0.2127
va: 6.0080 1.9831 1.9833 1.9871 2.0346 2.1294 2.1203 3.0790 3.0856 3.1766 2.9717 2.9676 3.7247 3.9209 3.9282 3.8355 3.5909 3.7575 3.9183 4.0731 3.9181 3.9162 4.4248 4.2256 3.9858 4.0188 3.9318 3.8390 3.8460 1.0115 1.0267 1.0198 1.0160 1.0328 0.9967 1.0217 1.0476 0.9894 0.9871 1.0170 1.0159 0.9898 0.9969 0.9960 0.9952 0.9932 0.9954 1.0595
dispcorr: -0.026880659 hartree
energy: -1782.756747332371
dipole: 0.01976 0.86785 0.88761 -15.83961 12.87930 -2.96031 3.43704 -2.85740 0.57964
magnitude: 3.14440 au
magnitude: 7.99243 debye
