program: Orca
programVersion: 4.2.1
elementType: S O O O O O O N N N N N C C C C C C C C C C C C C C C C C H H H H H H H H H H H H H H H H H H H
charge: 0
multiplicity: 1
keywords: wb97x-d3
keywords: def2-TZVPP
keywords: def2/J RIJCOSX GRIDX6 NOFINALGRIDX
keywords: grid4 nofinalgrid
keywords: scfconv7
keywords: smallprint printgap noloewdin
keywords: NOSOSCF
formula: C17H19N5O6S
InChI: InChI=1S/C17H19N5O6S/c1-27-13-9-14(28-2)19-16(18-13)20-17(24)22-29(25,26)21-12-6-4-3-5-11(12)15(23)10-7-8-10/h3-6,9-10,20-22H,7-8H2,1-2H3
48 atoms
S  -2.018198 2.225932 0.786035
O  -3.260977 -1.152411 -0.863323
O  -3.234744 2.205956 1.559342
O  -1.370249 3.480672 0.480355
O  -2.076756 -0.465959 2.085604
O  3.990949 -2.408076 -0.025063
O  3.214128 2.164769 -0.008303
N  -2.343071 1.409934 -0.619725
N  -0.814061 1.3495 1.542951
N  0.14149 -0.763638 1.795936
N  2.071271 -1.589809 0.910646
N  1.685886 0.738603 0.925016
C  -1.66598 -2.851534 -0.556059
C  -2.625249 -3.999251 -0.793882
C  -2.416121 -3.511877 0.582296
C  -2.089354 -1.494055 -0.94304
C  -1.063551 -0.532275 -1.432487
C  -1.248587 0.861169 -1.331735
C  0.084627 -1.003043 -2.070025
C  -0.314489 1.725216 -1.887077
C  1.027511 -0.136803 -2.597024
C  0.82128 1.22996 -2.5092
C  -0.994063 0.009535 1.822694
C  1.3543 -0.515268 1.1752
C  3.224409 -1.378093 0.29014
C  2.838773 0.933627 0.291258
C  3.674825 -0.111607 -0.060042
C  3.538428 -3.727068 0.272643
C  2.385332 3.260002 0.373635
H  -0.614496 -3.088828 -0.621191
H  -3.558486 -3.762843 -1.288082
H  -2.175835 -4.937013 -1.090585
H  -1.814589 -4.103068 1.259328
H  -3.200322 -2.934162 1.051604
H  0.239574 -2.06656 -2.184672
H  -0.477903 2.792475 -1.846265
H  -3.13156 0.771785 -0.52338
H  1.907148 -0.530262 -3.086362
H  1.537032 1.919492 -2.935471
H  -0.030882 -1.738697 2.005469
H  4.6124 0.047828 -0.57179
H  2.600709 -3.954484 -0.233637
H  3.416468 -3.880307 1.344156
H  4.313661 -4.391754 -0.097759
H  2.917387 4.153934 0.061195
H  2.232843 3.295772 1.452155
H  1.421074 3.233593 -0.133613
H  0.151203 1.62123 1.299091
elementType: S O N C H
totalener: -1782.72727629 hartree
nucrepener: 3351.18661162 hartree
electener: -5133.91388791 hartree
oneelecener: -9106.39536827 hartree
twoeener: 3972.48148037 hartree
cpcmener: -0.05261691 hartree
kineticenergy: 1776.14368606 hartree
xcener: -148.041236174951 hartree
chargesum: -0.0000000
charge: 0.871457 -0.479666 -0.490812 -0.496759 -0.430150 -0.298950 -0.295613 -0.218119 -0.171961 -0.134367 -0.391661 -0.395886 -0.101460 -0.141307 -0.140304 0.350803 0.010726 0.081958 -0.148037 -0.228926 -0.170835 -0.086163 0.263295 0.312083 0.423100 0.407605 -0.312510 -0.115395 -0.115403 0.107015 0.094614 0.107528 0.109192 0.088171 0.150809 0.166360 0.210397 0.163344 0.168550 0.198361 0.142842 0.112624 0.114789 0.134012 0.140835 0.128266 0.095598 0.209949
qa: 0.8715 -0.4797 -0.4908 -0.4968 -0.4301 -0.2990 -0.2956 -0.2181 -0.1720 -0.1344 -0.3917 -0.3959 -0.1015 -0.1413 -0.1403 0.3508 0.0107 0.0820 -0.1480 -0.2289 -0.1708 -0.0862 0.2633 0.3121 0.4231 0.4076 -0.3125 -0.1154 -0.1154 0.1070 0.0946 0.1075 0.1092 0.0882 0.1508 0.1664 0.2104 0.1633 0.1686 0.1984 0.1428 0.1126 0.1148 0.1340 0.1408 0.1283 0.0956 0.2099
va: 6.0090 1.9945 2.0017 1.9859 2.0711 2.1229 2.1153 3.0148 3.0666 3.1743 2.9352 2.9501 3.7227 3.9427 3.9155 3.7693 3.4715 3.8219 3.8587 3.9904 3.8895 3.7846 4.5208 4.2764 3.9959 3.9558 3.9321 3.8543 3.8401 1.0083 1.0277 1.0189 1.0154 1.0385 0.9986 1.0116 1.0482 0.9911 0.9869 1.0107 1.0186 0.9913 0.9946 0.9938 0.9962 0.9904 0.9917 1.0783
dispcorr: -0.035968331 hartree
energy: -1782.763244618152
dipole: 10.12024 -5.35438 4.76586 -16.29315 13.42996 -2.86318 -6.64057 4.87642 -1.76414
magnitude: 5.83296 au
magnitude: 14.82621 debye
