program: Orca
programVersion: 4.2.1
elementType: S O O O O O O N N N N N C C C C C C C C C C C C C C C C C H H H H H H H H H H H H H H H H H H H
charge: 0
multiplicity: 1
keywords: wb97x-d3
keywords: def2-TZVPP
keywords: def2/J RIJCOSX GRIDX6 NOFINALGRIDX
keywords: grid4 nofinalgrid
keywords: scfconv7
keywords: smallprint printgap noloewdin
keywords: NOSOSCF
formula: C17H19N5O6S
InChI: InChI=1S/C17H19N5O6S/c1-27-13-9-14(28-2)19-16(18-13)20-17(24)22-29(25,26)21-12-6-4-3-5-11(12)15(23)10-7-8-10/h3-6,9-10,20-22H,7-8H2,1-2H3
48 atoms
S  -2.025278 2.319939 0.481365
O  -3.088406 -1.262716 -0.800701
O  -3.284327 2.381467 1.178658
O  -1.348308 3.532377 0.0846
O  -2.190143 -0.19026 2.125472
O  3.758286 -2.526885 0.124682
O  3.235066 2.078002 -0.088786
N  -2.273179 1.362642 -0.84851
N  -0.874737 1.520877 1.395152
N  0.016094 -0.583123 1.868309
N  1.895217 -1.555562 1.025306
N  1.631384 0.786909 0.910727
C  -1.414886 -2.823711 -0.253042
C  -2.292744 -4.050369 -0.389646
C  -2.172476 -3.396629 0.927044
C  -1.900808 -1.551563 -0.820032
C  -0.910577 -0.611954 -1.413838
C  -1.142594 0.776381 -1.467868
C  0.257498 -1.112503 -1.990093
C  -0.222703 1.60708 -2.094775
C  1.17863 -0.278016 -2.599044
C  0.934837 1.084881 -2.650032
C  -1.095494 0.223902 1.81556
C  1.2361 -0.432119 1.230656
C  3.057266 -1.438914 0.396116
C  2.796169 0.886624 0.276045
C  3.578999 -0.218084 -0.010787
C  3.211477 -3.801081 0.455647
C  2.462847 3.233586 0.227663
H  -0.347317 -2.992328 -0.249813
H  -3.216612 -3.92896 -0.940056
H  -1.778731 -4.986335 -0.559739
H  -1.567977 -3.869997 1.689462
H  -3.009815 -2.822153 1.298326
H  0.444233 -2.177414 -1.990464
H  -0.41768 2.667387 -2.16493
H  -3.058019 0.725655 -0.726256
H  2.072906 -0.693954 -3.041034
H  1.637603 1.747331 -3.136372
H  -0.187393 -1.531471 2.157191
H  4.523955 -0.136098 -0.527212
H  3.083622 -3.919694 1.530791
H  3.932597 -4.530407 0.097953
H  2.255866 -3.969955 -0.041103
H  3.038706 4.080001 -0.13527
H  2.314705 3.339225 1.3022
H  1.496668 3.22642 -0.27743
H  0.10407 1.746475 1.161252
elementType: S O N C H
totalener: -1782.72555432 hartree
nucrepener: 3374.47236898 hartree
electener: -5157.19792330 hartree
oneelecener: -9152.82015501 hartree
twoeener: 3995.62223171 hartree
cpcmener: -0.05194873 hartree
kineticenergy: 1776.15134606 hartree
xcener: -148.043387793059 hartree
chargesum: -0.0000000
charge: 0.869826 -0.475143 -0.486950 -0.495527 -0.426089 -0.298501 -0.295067 -0.216037 -0.169372 -0.138276 -0.390390 -0.398868 -0.103924 -0.136685 -0.155620 0.348566 0.025090 0.077058 -0.160367 -0.220285 -0.169123 -0.083231 0.255660 0.308635 0.421127 0.411024 -0.313700 -0.113129 -0.114422 0.096719 0.095202 0.108006 0.113632 0.092103 0.155923 0.162080 0.208690 0.163042 0.167525 0.203957 0.141675 0.115122 0.135532 0.110771 0.141343 0.128570 0.094538 0.209290
qa: 0.8698 -0.4751 -0.4869 -0.4955 -0.4261 -0.2985 -0.2951 -0.2160 -0.1694 -0.1383 -0.3904 -0.3989 -0.1039 -0.1367 -0.1556 0.3486 0.0251 0.0771 -0.1604 -0.2203 -0.1691 -0.0832 0.2557 0.3086 0.4211 0.4110 -0.3137 -0.1131 -0.1144 0.0967 0.0952 0.1080 0.1136 0.0921 0.1559 0.1621 0.2087 0.1630 0.1675 0.2040 0.1417 0.1151 0.1355 0.1108 0.1413 0.1286 0.0945 0.2093
va: 6.0127 2.0002 2.0055 1.9883 2.0750 2.1197 2.1147 3.0176 3.0633 3.1718 2.9293 2.9488 3.7243 3.9440 3.9177 3.7469 3.4527 3.8276 3.8441 3.9942 3.8829 3.7906 4.5301 4.2820 3.9942 3.9508 3.9323 3.8543 3.8399 1.0065 1.0278 1.0191 1.0138 1.0393 0.9929 1.0154 1.0468 0.9907 0.9873 1.0069 1.0196 0.9948 0.9937 0.9868 0.9951 0.9907 0.9930 1.0770
dispcorr: -0.037158510 hartree
energy: -1782.762712834532
dipole: 10.80273 -5.98903 4.81370 -16.86399 13.89859 -2.96540 -4.78970 3.36916 -1.42054
magnitude: 5.82952 au
magnitude: 14.81746 debye
