program: Orca
programVersion: 4.2.1
elementType: S O O O O O O N N N N N C C C C C C C C C C C C C C C C C H H H H H H H H H H H H H H H H H H H
charge: 0
multiplicity: 1
keywords: wb97x-d3
keywords: def2-TZVPP
keywords: def2/J RIJCOSX GRIDX6 NOFINALGRIDX
keywords: grid4 nofinalgrid
keywords: scfconv7
keywords: smallprint printgap noloewdin
keywords: NOSOSCF
formula: C17H19N5O6S
InChI: InChI=1S/C17H19N5O6S/c1-27-13-9-14(28-2)19-16(18-13)20-17(24)22-29(25,26)21-12-6-4-3-5-11(12)15(23)10-7-8-10/h3-6,9-10,20-22H,7-8H2,1-2H3
48 atoms
S  -1.883233 0.813604 0.727734
O  -2.897293 -3.06684 -0.67104
O  -2.003883 -0.559615 1.156898
O  -2.557519 1.881499 1.423752
O  -0.266584 3.151744 -0.12009
O  2.586077 -1.978349 2.071453
O  6.048515 0.983598 1.193656
N  -2.355155 0.920448 -0.846187
N  -0.237357 1.058437 0.758725
N  1.731396 2.219863 0.375544
N  2.138268 0.09753 1.226565
N  3.889094 1.613975 0.779529
C  -4.39604 -1.26297 -0.931851
C  -5.097577 -1.379525 0.40038
C  -5.62714 -2.122737 -0.762517
C  -3.09543 -1.943119 -1.093259
C  -2.031806 -1.265896 -1.897909
C  -1.719714 0.092381 -1.807577
C  -1.335785 -2.048328 -2.818675
C  -0.766391 0.65201 -2.649934
C  -0.399172 -1.487615 -3.670297
C  -0.122113 -0.130317 -3.59344
C  0.359233 2.204045 0.313936
C  2.618483 1.259264 0.818007
C  3.01987 -0.803145 1.649081
C  4.756831 0.704015 1.201625
C  4.379754 -0.552404 1.66209
C  1.184649 -2.243087 2.05582
C  6.484269 2.258894 0.729479
H  -4.522797 -0.332189 -1.465309
H  -4.584126 -1.935485 1.17346
H  -5.620882 -0.498227 0.745643
H  -6.52681 -1.762801 -1.243185
H  -5.49281 -3.196079 -0.791834
H  -1.558763 -3.104273 -2.892812
H  -0.531426 1.70587 -2.569134
H  -2.480411 1.886763 -1.134965
H  0.109258 -2.107873 -4.395558
H  0.605319 0.319586 -4.255091
H  2.152728 3.08357 0.059873
H  5.099045 -1.281396 2.004887
H  1.071526 -3.2532 2.438746
H  0.779297 -2.204268 1.04438
H  0.638303 -1.558311 2.704618
H  6.076152 3.069266 1.332269
H  6.222373 2.418093 -0.315925
H  7.566049 2.250734 0.828475
H  0.379008 0.289214 1.060509
elementType: S O N C H
totalener: -1782.72902567 hartree
nucrepener: 3144.51998229 hartree
electener: -4927.24900796 hartree
oneelecener: -8694.06952685 hartree
twoeener: 3766.82051889 hartree
cpcmener: -0.05170029 hartree
kineticenergy: 1776.14941051 hartree
xcener: -148.038122303793 hartree
chargesum: 0.0000000
charge: 0.890188 -0.473865 -0.492656 -0.500924 -0.485934 -0.297940 -0.299497 -0.216789 -0.181586 -0.129334 -0.427854 -0.426360 -0.077010 -0.132605 -0.160723 0.265734 0.014821 0.139516 -0.122028 -0.204031 -0.174896 -0.103606 0.339652 0.375534 0.425141 0.421008 -0.323243 -0.119930 -0.115158 0.111153 0.086510 0.099091 0.107393 0.090010 0.145603 0.153306 0.193026 0.165038 0.167883 0.193261 0.147770 0.140909 0.107270 0.114082 0.114647 0.114840 0.132785 0.209800
qa: 0.8902 -0.4739 -0.4927 -0.5009 -0.4859 -0.2979 -0.2995 -0.2168 -0.1816 -0.1293 -0.4279 -0.4264 -0.0770 -0.1326 -0.1607 0.2657 0.0148 0.1395 -0.1220 -0.2040 -0.1749 -0.1036 0.3397 0.3755 0.4251 0.4210 -0.3232 -0.1199 -0.1152 0.1112 0.0865 0.0991 0.1074 0.0900 0.1456 0.1533 0.1930 0.1650 0.1679 0.1933 0.1478 0.1409 0.1073 0.1141 0.1146 0.1148 0.1328 0.2098
va: 5.9792 2.0025 1.9998 1.9951 2.0179 2.1337 2.1219 3.0510 3.0976 3.1843 2.9817 2.9712 3.6470 3.9140 3.9482 3.8422 3.6630 3.7332 3.9272 3.9876 3.9468 3.9280 4.4253 4.2449 3.9801 4.0167 3.9314 3.8418 3.8453 1.0142 1.0322 1.0195 1.0158 1.0296 1.0117 1.0178 1.0181 0.9884 0.9870 1.0164 1.0158 0.9957 0.9939 0.9934 0.9952 0.9952 0.9934 1.0742
dispcorr: -0.027836117 hartree
energy: -1782.756861790740
dipole: -0.67278 3.39880 2.72602 -6.33429 7.08782 0.75353 -5.49901 3.52316 -1.97585
magnitude: 3.45007 au
magnitude: 8.76937 debye
