program: Orca
programVersion: 4.2.1
elementType: S O O O O O O N N N N N C C C C C C C C C C C C C C C C C H H H H H H H H H H H H H H H H H H H
charge: 0
multiplicity: 1
keywords: wb97x-d3
keywords: def2-TZVPP
keywords: def2/J RIJCOSX GRIDX6 NOFINALGRIDX
keywords: grid4 nofinalgrid
keywords: scfconv7
keywords: smallprint printgap noloewdin
keywords: NOSOSCF
formula: C17H19N5O6S
InChI: InChI=1S/C17H19N5O6S/c1-27-13-9-14(28-2)19-16(18-13)20-17(24)22-29(25,26)21-12-6-4-3-5-11(12)15(23)10-7-8-10/h3-6,9-10,20-22H,7-8H2,1-2H3
48 atoms
S  -2.06311 2.211897 0.488089
O  -3.505789 -1.23754 -0.816935
O  -3.269325 2.241572 1.277696
O  -1.466529 3.448976 0.038107
O  -1.985964 -0.386228 1.947471
O  3.204642 2.462864 -0.097118
O  4.356816 -2.002415 0.40209
N  -2.376805 1.229062 -0.808959
N  -0.819571 1.463368 1.31083
N  0.260663 -0.542913 1.79082
N  1.736965 1.000064 0.874667
N  2.309743 -1.27618 1.118046
C  -2.076815 -3.031307 -0.299027
C  -3.100759 -4.124124 -0.536146
C  -2.958378 -3.547079 0.814358
C  -2.367604 -1.686809 -0.82629
C  -1.247132 -0.876197 -1.375773
C  -1.302203 0.53134 -1.404698
C  -0.124229 -1.506599 -1.911898
C  -0.259587 1.253796 -1.970058
C  0.924119 -0.781067 -2.451917
C  0.852203 0.602203 -2.480529
C  -0.925283 0.143969 1.697272
C  1.489824 -0.249281 1.227359
C  2.911496 1.235759 0.297454
C  3.483136 -1.022282 0.554625
C  3.850521 0.239118 0.101787
C  2.256511 3.506406 0.112862
C  4.010635 -3.315827 0.836075
H  -1.042237 -3.339567 -0.26326
H  -3.971916 -3.859037 -1.121059
H  -2.705316 -5.111981 -0.729181
H  -2.458291 -4.127556 1.577459
H  -3.730601 -2.882772 1.178106
H  -0.06822 -2.586274 -1.925327
H  -0.319777 2.331583 -2.025651
H  -3.208379 0.656316 -0.670262
H  1.783791 -1.295411 -2.857634
H  1.656608 1.181695 -2.912951
H  0.15253 -1.503889 2.087709
H  4.80711 0.431029 -0.361291
H  1.349068 3.347431 -0.469692
H  2.737399 4.415805 -0.235713
H  2.003929 3.620449 1.166794
H  3.837096 -3.352535 1.910922
H  4.866553 -3.938408 0.59156
H  3.132018 -3.693911 0.314692
H  0.135773 1.777833 1.075188
elementType: S O N C H
totalener: -1782.72798067 hartree
nucrepener: 3314.64884922 hartree
electener: -5097.37682990 hartree
oneelecener: -9033.56696880 hartree
twoeener: 3936.19013890 hartree
cpcmener: -0.05277988 hartree
kineticenergy: 1776.15315574 hartree
xcener: -148.043287787075 hartree
chargesum: 0.0000000
charge: 0.874310 -0.486101 -0.493026 -0.498533 -0.432426 -0.295242 -0.299155 -0.222776 -0.185618 -0.129297 -0.397782 -0.394667 -0.080358 -0.138022 -0.140920 0.328363 -0.017805 0.131228 -0.119821 -0.270421 -0.184814 -0.066529 0.278164 0.318564 0.402591 0.418259 -0.307756 -0.112910 -0.115573 0.106099 0.094886 0.105784 0.106037 0.084926 0.152405 0.173756 0.213108 0.161878 0.165797 0.194197 0.146076 0.093530 0.140412 0.126055 0.115308 0.132606 0.114363 0.210849
qa: 0.8743 -0.4861 -0.4930 -0.4985 -0.4324 -0.2952 -0.2992 -0.2228 -0.1856 -0.1293 -0.3978 -0.3947 -0.0804 -0.1380 -0.1409 0.3284 -0.0178 0.1312 -0.1198 -0.2704 -0.1848 -0.0665 0.2782 0.3186 0.4026 0.4183 -0.3078 -0.1129 -0.1156 0.1061 0.0949 0.1058 0.1060 0.0849 0.1524 0.1738 0.2131 0.1619 0.1658 0.1942 0.1461 0.0935 0.1404 0.1261 0.1153 0.1326 0.1144 0.2108
va: 6.0087 1.9833 2.0008 1.9827 2.0733 2.1179 2.1233 3.0241 3.0607 3.1779 2.9496 2.9359 3.7130 3.9313 3.9247 3.8229 3.5467 3.7673 3.8821 4.0118 3.8969 3.7988 4.5124 4.2679 3.9671 4.0038 3.9368 3.8405 3.8495 1.0116 1.0265 1.0192 1.0161 1.0357 0.9974 1.0015 1.0486 0.9914 0.9891 1.0144 1.0164 0.9942 0.9968 0.9900 0.9947 0.9939 0.9941 1.0815
dispcorr: -0.034212864 hartree
energy: -1782.762193537631
dipole: 9.24382 -4.48001 4.76380 -16.80063 13.76284 -3.03779 -4.43541 3.24248 -1.19293
magnitude: 5.77452 au
magnitude: 14.67766 debye
