program: Orca
programVersion: 4.2.1
elementType: S O O O O O O N N N N N C C C C C C C C C C C C C C C C C H H H H H H H H H H H H H H H H H H H
charge: 0
multiplicity: 1
keywords: wb97x-d3
keywords: def2-TZVPP
keywords: def2/J RIJCOSX GRIDX6 NOFINALGRIDX
keywords: grid4 nofinalgrid
keywords: scfconv7
keywords: smallprint printgap noloewdin
keywords: NOSOSCF
formula: C17H19N5O6S
InChI: InChI=1S/C17H19N5O6S/c1-27-13-9-14(28-2)19-16(18-13)20-17(24)22-29(25,26)21-12-6-4-3-5-11(12)15(23)10-7-8-10/h3-6,9-10,20-22H,7-8H2,1-2H3
48 atoms
S  -0.857262 1.362052 -1.667204
O  -3.430545 -1.596866 -1.819256
O  -0.875988 2.738944 -1.222742
O  -0.732284 1.067836 -3.075937
O  0.018945 -1.451021 -1.42102
O  3.546552 3.137464 0.99472
O  6.0505 -0.719934 1.616735
N  -2.196187 0.564278 -1.18337
N  0.403685 0.703869 -0.810898
N  1.918237 -0.97735 -0.295261
N  2.708298 1.108141 0.357334
N  3.976395 -0.857889 0.664781
C  -4.906684 -2.718286 -0.395382
C  -4.620209 -4.124382 -0.890032
C  -5.665341 -3.317607 -1.552311
C  -3.891251 -1.686032 -0.683187
C  -3.428475 -0.782861 0.398769
C  -2.57662 0.317293 0.136991
C  -3.810038 -1.019781 1.722926
C  -2.174091 1.141426 1.184699
C  -3.385406 -0.216071 2.761929
C  -2.569823 0.869443 2.482227
C  0.730357 -0.625169 -0.887764
C  2.906074 -0.196118 0.267274
C  3.691071 1.827623 0.890486
C  4.94553 -0.127185 1.198366
C  4.865303 1.25296 1.342453
C  2.341723 3.739831 0.526851
C  6.178392 -2.133255 1.475896
H  -5.450331 -2.651991 0.533945
H  -3.683495 -4.280789 -1.408645
H  -4.916246 -4.928969 -0.230991
H  -6.701928 -3.5575 -1.35848
H  -5.464582 -2.924209 -2.539608
H  -4.442996 -1.861725 1.959328
H  -1.562748 2.01293 1.006004
H  -2.476517 -0.196271 -1.818756
H  -3.692531 -0.430772 3.775473
H  -2.238188 1.522158 3.278281
H  2.127102 -1.966067 -0.341936
H  5.664828 1.836647 1.773758
H  2.45649 4.804608 0.706628
H  1.472709 3.382183 1.079158
H  2.199193 3.57853 -0.541744
H  7.155557 -2.379214 1.881555
H  6.137584 -2.439046 0.431354
H  5.413133 -2.665605 2.039062
H  1.095917 1.333975 -0.377465
elementType: S O N C H
totalener: -1782.73294174 hartree
nucrepener: 3061.20486890 hartree
electener: -4843.93781064 hartree
oneelecener: -8528.02940259 hartree
twoeener: 3684.09159195 hartree
cpcmener: -0.05149076 hartree
kineticenergy: 1776.14751075 hartree
xcener: -148.051136778129 hartree
chargesum: -0.0000000
charge: 0.880062 -0.473581 -0.506805 -0.502225 -0.480481 -0.298110 -0.300434 -0.175163 -0.217760 -0.136988 -0.430378 -0.426175 -0.083162 -0.138204 -0.146649 0.342645 -0.052798 0.123746 -0.116347 -0.228892 -0.209840 -0.088775 0.381501 0.373842 0.428399 0.421645 -0.324435 -0.124664 -0.115044 0.107286 0.097693 0.104366 0.107444 0.090628 0.151999 0.145017 0.210282 0.164431 0.167411 0.192995 0.147322 0.140381 0.113961 0.111414 0.132816 0.114825 0.114550 0.210251
qa: 0.8801 -0.4736 -0.5068 -0.5022 -0.4805 -0.2981 -0.3004 -0.1752 -0.2178 -0.1370 -0.4304 -0.4262 -0.0832 -0.1382 -0.1466 0.3426 -0.0528 0.1237 -0.1163 -0.2289 -0.2098 -0.0888 0.3815 0.3738 0.4284 0.4216 -0.3244 -0.1247 -0.1150 0.1073 0.0977 0.1044 0.1074 0.0906 0.1520 0.1450 0.2103 0.1644 0.1674 0.1930 0.1473 0.1404 0.1140 0.1114 0.1328 0.1148 0.1145 0.2103
va: 6.0212 2.0150 1.9684 1.9901 2.0369 2.1317 2.1212 3.1117 3.0673 3.1868 2.9752 2.9705 3.7646 3.9042 3.9175 3.8326 3.6921 3.9239 3.8826 3.9803 3.9569 3.9469 4.4037 4.2495 3.9754 4.0157 3.9303 3.8453 3.8452 1.0139 1.0245 1.0191 1.0159 1.0316 1.0045 1.0266 1.0800 0.9895 0.9864 1.0162 1.0159 0.9960 0.9905 0.9942 0.9935 0.9953 0.9952 1.0705
dispcorr: -0.024768713 hartree
energy: -1782.757710457320
dipole: -6.24881 6.99266 0.74385 -10.92146 9.62308 -1.29838 10.06688 -6.01662 4.05026
magnitude: 4.31784 au
magnitude: 10.97507 debye
